Re: Bug #12795 Updated: php-4.0.7RC1: make error

From: Date: Sat, 18 Aug 2001 20:20:27 +0000
Subject: Re: Bug #12795 Updated: php-4.0.7RC1: make error
References: 1  Groups: php.dev 
Request: Send a blank email to php-dev+get-63620@lists.php.net to get a copy of this message
Okay. I have to download it first.. :) --Jani On Sat, 18 Aug 2001, Joey Smith wrote: >Bump it. 2.4.0 looks solid. > >On 18 Aug 2001, sniper@php.net wrote the following to php-dev@lists.php.net : > >> ID: 12795 >> Updated by: sniper >> Reported By: colin@easydns.com >> Old Status: Open >> Status: Assigned >> Old Bug Type: Compile Failure >> Bug Type: DOM XML related >> Operating System: rh 7.2 >> PHP Version: 4.0.6 >> Old Assigned To: >> Assigned To: sniper >> New Comment: >> >> This is cause by too old libxml version. >> Now waiting for replies what whether we require >> newer version or not. >> >> --Jani >> >> >> Previous Comments: >> ------------------------------------------------------------------------ >> >> [2001-08-16 11:27:12] colin@easydns.com >> >> ./configure \ >> --with-mysql=/usr/local \ >> --disable-pear \ >> --enable-track-vars \ >> --enable-debug \ >> --disable-magic-quotes \ >> --enable-ftp \ >> --with-gettext \ >> --with-xml \ >> --with-dom \ >> --enable-wddx \ >> --with-curl \ >> --with-pgsql \ >> --with-zlib \ >> --enable-versioning \ >> --enable-sockets \ >> --with-openssl \ >> --with-snmp \ >> --with-readline \ >> --with-mcrypt >> >> ... >> >> php_domxml.c: In function `php_xpathptr_eval': >> php_domxml.c:2719: `XPATH_XSLT_TREE' undeclared (first use in this function) >> php_domxml.c:2719: (Each undeclared identifier is reported only once >> php_domxml.c:2719: for each function it appears in.) >> make[3]: *** [php_domxml.lo] Error 1 >> make[3]: Leaving directory `/usr/local/sources/php-4.0.7RC1/ext/domxml' >> make[2]: *** [all-recursive] Error 1 >> make[2]: Leaving directory `/usr/local/sources/php-4.0.7RC1/ext/domxml' >> make[1]: *** [all-recursive] Error 1 >> make[1]: Leaving directory `/usr/local/sources/php-4.0.7RC1/ext' >> make: *** [all-recursive] Error 1 >> >> >> ------------------------------------------------------------------------ >> >> >> >> Edit this bug report at >> http://bugs.php.net/?id=12795&edit=1 >> >> >> > > >

« previous php.dev (#63620) next »