Bug #13416: Compile errors on make of Apache 1.3.20, PHP & MySLQ Last Version
| From: | zonzon at zonzon dot yi dot org | Date: | Mon, 24 Sep 2001 16:05:26 +0000 |
| Subject: | Bug #13416: Compile errors on make of Apache 1.3.20, PHP & MySLQ Last Version | ||
| Groups: | php.dev | ||
| Request: | Send a blank email to php-dev+get-66472@lists.php.net to get a copy of this message | ||
From: zonzon@zonzon.yi.org
Operating system: Slackware 8.0 2.2.19 Kernel
PHP version: 4.0.6
PHP Bug Type: MySQL related
Bug description: Compile errors on make of Apache 1.3.20, PHP & MySLQ Last Version
hello,
I don't know if this compile bug is caused by mysql libraries or apache or
php. I've always used the same configure flags to compile my apache + mysql
+ php on my others linux & freebsd servers and it works fine. Do you know
the cause of this error?
Thanx a lot
Bruno Lavoie
zonzon@zonzon.yi.org
<=== src/modules/php4
<=== src/modules
gcc -c -I./os/unix -I./include -DLINUX=22 -I/root/php-4.0.6
-I/root/php-4.0.6/main -I/root/php-4.0.6/main -I
/root/php-4.0.6/Zend -I/root/php-4.0.6/Zend -I/root/php-4.0.6/TSRM
-I/root/php-4.0.6/TSRM -I/root/php-4.0.6 -DU
SE_EXPAT -I./lib/expat-lite -DNO_DL_NEEDED
./apaci modules.c
gcc -c -I./os/unix -I./include -DLINUX=22 -I/root/php-4.0.6
-I/root/php-4.0.6/main -I/root/php-4.0.6/main -I
/root/php-4.0.6/Zend -I/root/php-4.0.6/Zend -I/root/php-4.0.6/TSRM
-I/root/php-4.0.6/TSRM -I/root/php-4.0.6 -DU
SE_EXPAT -I./lib/expat-lite -DNO_DL_NEEDED ./apaci buildmark.c
gcc -DLINUX=22 -I/root/php-4.0.6 -I/root/php-4.0.6/main
-I/root/php-4.0.6/main -I/root/php-4.0.6/Zend -I/root/
php-4.0.6/Zend -I/root/php-4.0.6/TSRM -I/root/php-4.0.6/TSRM
-I/root/php-4.0.6 -DUSE_EXPAT -I./lib/expat-lite -
DNO_DL_NEEDED ./apaci \
-o httpd buildmark.o modules.o modules/standard/libstandard.a
modules/php4/libphp4.a main/libmain.a ./os/
unix/libos.a ap/libap.a lib/expat-lite/libexpat.a
-Wl,-rpath,/usr/local/lib -Wl,-rpath,/usr/local/mysql/lib
-rdynamic -L/usr/local/lib -L/usr/local/mysql/lib -Lmodules/php4
-L../modules/php4 -L../../modules/php4 -lmodph
p4 -lc-client -ldl -lmysqlclient -lcrypt -lresolv -lm -ldl -lnsl
-lresolv -lm -lcrypt
/usr/local/mysql/lib/libmysqlclient.a(my_compress.o): In function
`my_uncompress':
my_compress.o(.text+0x9a): undefined reference to `uncompress'
/usr/local/mysql/lib/libmysqlclient.a(my_compress.o): In function
`my_compress_alloc':
my_compress.o(.text+0x12a): undefined reference to `compress'
collect2: ld returned 1 exit status
make[2]: *** [target_static] Error 1
make[2]: Leaving directory `/root/apache_1.3.20/src'
make[1]: *** [build-std] Error 2
make[1]: Leaving directory `/root/apache_1.3.20'
make: *** [build] Error 2
--
Edit bug report at: http://bugs.php.net/?id=13416&edit=1