Bug #12132 Updated: Doesn't compile

From: Date: Tue, 02 Oct 2001 22:25:58 +0000
Subject: Bug #12132 Updated: Doesn't compile
References: 1  Groups: php.dev 
Request: Send a blank email to php-dev+get-67135@lists.php.net to get a copy of this message
ID: 12132 Updated by: sniper Reported By: lhp@zoso.at Old Status: Feedback Status: Closed Bug Type: Compile Failure Operating System: HP-UX 11 PHP Version: 4.0.6 New Comment: No feedback. Previous Comments: ------------------------------------------------------------------------ [2001-08-18 14:01:49] sniper@php.net Does this happen with latest CVS snapshot: http://snaps.php.net/ --Jani ------------------------------------------------------------------------ [2001-07-13 03:37:44] lhp@zoso.at my config-line: ./configure --with-apxs=/usr/local/apache/bin/apxs --with-mysql=/usr/local/mysql/ (The built-in mysql support doesn't compile on my machine...) And php doesn't compile... (neither on my HP nor on my Linux (Redhat 6.2, 2-PIII 450) machine) (also version 4.0.5 doesn't compile) error message on HP-UX: php_pcre.c: In function `pcre_get_compiled_regex': php_pcre.c:158: `LC_CTYPE' undeclared (first use in this function) php_pcre.c:158: (Each undeclared identifier is reported only once php_pcre.c:158: for each function it appears in.) php_pcre.c:158: warning: initialization makes pointer from integer without a cast gmake[3]: *** [php_pcre.lo] Fehler 1 gmake[3]: Verlassen des Verzeichnisses Verzeichnis »/tmp_mnt/ux01/big/logins/lhp/dw/php/php-4.0.6/ext/pcre« gmake[2]: *** [all-recursive] Fehler 1 gmake[2]: Verlassen des Verzeichnisses Verzeichnis »/tmp_mnt/ux01/big/logins/lhp/dw/php/php-4.0.6/ext/pcre« gmake[1]: *** [all-recursive] Fehler 1 gmake[1]: Verlassen des Verzeichnisses Verzeichnis »/tmp_mnt/ux01/big/logins/lhp/dw/php/php-4.0.6/ext« gmake: *** [all-recursive] Fehler 1 ------------------------------------------------------------------------ Edit this bug report at http://bugs.php.net/?id=12132&edit=1

« previous php.dev (#67135) next »