Bug #8996 Updated: Netscape Enterprise 4.1 problem during make
| From: | sander@php.net | Date: | Tue, 09 Oct 2001 18:29:13 +0000 |
| Subject: | Bug #8996 Updated: Netscape Enterprise 4.1 problem during make | ||
| References: | 1 | Groups: | php.dev |
| Request: | Send a blank email to php-dev+get-67624@lists.php.net to get a copy of this message | ||
ID: 8996
Updated by: sander
Reported By: prana@agrokor.hr
Old Status: Open
Status: Bogus
Bug Type: iPlanet related
Operating System: Solaris 8
PHP Version: 4.0.4pl1
New Comment:
Probably not a bug in PHP. Ask support questions on the appropriate mailinglist (see http://www.php.net/support.php).
Previous Comments:
------------------------------------------------------------------------
[2001-01-30 06:29:47] prana@agrokor.hr
./configure --with-mysql=/usr/local/mysql --with-nsapi=/usr/netscape/server4 --enable-track-vars
--enable-libgcc worked ok, but with make I get folowing errors:
nsapi.c:50: nsapi.h: No such file or directory
nsapi.c:51: base/pblock.h: No such file or directory
nsapi.c:52: base/session.h: No such file or directory
nsapi.c:53: frame/req.h: No such file or directory
nsapi.c:54: frame/protocol.h: No such file or directory
nsapi.c:55: base/util.h: No such file or directory
nsapi.c:56: frame/log.h: No such file or directory
make[3]: *** [nsapi.lo] Error 1
make[2]: *** [all-recursive] Error 1
make[1]: *** [all-recursive] Error 1
make: *** [all-recursive] Error 1
/usr/software/php-4.04pl1/pear/tests/php.ini
include_path=..
------------------------------------------------------------------------
Edit this bug report at http://bugs.php.net/?id=8996&edit=1