Bug #14012 Updated: a struct has problem for sysvshm
| From: | mfischer@php.net | Date: | Sun, 11 Nov 2001 02:58:58 +0000 |
| Subject: | Bug #14012 Updated: a struct has problem for sysvshm | ||
| References: | 1 | Groups: | php.dev |
| Request: | Send a blank email to php-dev+get-70058@lists.php.net to get a copy of this message | ||
ID: 14012
Updated by: mfischer
Reported By: yasuo_ohgaki@yahoo.com
Old Status: Open
Status: Closed
Bug Type: Compile Failure
Operating System: linux 2.4.4/glibc 2.2.2
PHP Version: 4.0CVS-2001-11-10
New Comment:
Fixed in CVS.
Previous Comments:
------------------------------------------------------------------------
[2001-11-10 21:03:41] yasuo_ohgaki@yahoo.com
Just a build problem. I don't know the code, so patch is not attached.
make[3]: Entering directory `/home/yohgaki/cvs/php/PHP4/ext/sysvshm'
gcc -I. -I/home/yohgaki/cvs/php/PHP4/ext/sysvshm -I/home/yohgaki/cvs/php/PHP4/main
-I/home/yohgaki/cvs/php/PHP4 -I/home/yohgaki/cvs/php/PHP4/Zend -I/usr/local/include
-I/usr/include/freetype2/freetype -I/home/yohgaki/cvs/php/PHP4/ext/xml/expat
-I/home/yohgaki/cvs/php/PHP4/TSRM -g -Wall -c sysvshm.c && touch sysvshm.lo
sysvshm.c: In function `zif_shm_get_var':
sysvshm.c:305: structure has no member named `first'
sysvshm.c:306: warning: passing arg 4 of `php_var_unserialize' from incompatible pointer type
sysvshm.c:307: warning: passing arg 1 of `var_destroy' from incompatible pointer type
sysvshm.c:311: warning: passing arg 1 of `var_destroy' from incompatible pointer type
make[3]: *** [sysvshm.lo] Error 1
make[3]: Leaving directory `/home/yohgaki/cvs/php/PHP4/ext/sysvshm'
make[2]: *** [all-recursive] Error 1
make[2]: Leaving directory `/home/yohgaki/cvs/php/PHP4/ext/sysvshm'
make[1]: *** [all-recursive] Error 1
make[1]: Leaving directory `/home/yohgaki/cvs/php/PHP4/ext'
make: *** [all-recursive] Error 1
[yohgaki@dev PHP4]$
------------------------------------------------------------------------
Edit this bug report at http://bugs.php.net/?id=14012&edit=1