Bug #14075 Updated: PHP/Apache compile with domxml

From: Date: Thu, 15 Nov 2001 23:07:38 +0000
Subject: Bug #14075 Updated: PHP/Apache compile with domxml
References: 1  Groups: php.dev 
Request: Send a blank email to php-dev+get-70607@lists.php.net to get a copy of this message
ID: 14075 User updated by: evan@cache.net Reported By: evan@cache.net Status: Open Bug Type: DOM XML related Operating System: RedHat 7.1 PHP Version: 4.0.6 New Comment: Just want to mention my versions: libxml2-2.4.10-1 apache-1.3.22 php4.0.6 RedHat 7.1 Previous Comments: ------------------------------------------------------------------------ [2001-11-15 17:33:32] evan@cache.net PHP Configure: /configure --prefix=/usr --with-config-file-path=/etc --disable-debug --enable-pic --enable-shared --enable-inline-optimization --with-exec-dir=/usr/bin --with-regex=system --with-gettext --with-gd --with-jpeg-dir=/usr --with-png --with-zlib --with-db2 --with-db3 --with-gdbm --enable-debugger --enable-magic-quotes --enable-safe-mode --enable-sockets --enable-sysvsem --enable-sysvshm --enable-track-vars --enable-yp --enable-ftp --enable-wddx --with-mysql --without-oracle --without-oci8 --with-xml --with-apache=/home/evan/CMS/apache_1.3.22 --with-dom Apache Configure: ./configure --with-layout=Apache --prefix=/vars/www --activate-module=src/modules/php4/libphp4.a PHP makes fine as does libxml2(I also tried a RH7.1 rpm). I also had to do a ln -s to get --with-dom to work (originally I pointed --with-dom=/path/to/XML which produced identical results as below). The following is the output of Apache make: ===> src make[1]: Entering directory `/home/evan/CMS/apache_1.3.22' make[2]: Entering directory `/home/evan/CMS/apache_1.3.22/src' ===> src/os/unix make[3]: Nothing to be done for `all'. <=== src/os/unix ===> src/ap make[3]: Nothing to be done for `all'. <=== src/ap ===> src/main make[3]: Nothing to be done for `all'. <=== src/main ===> src/lib <=== src/lib ===> src/modules ===> src/modules/standard make[4]: Nothing to be done for `all'. <=== src/modules/standard ===> src/modules/php4 make[4]: Nothing to be done for `all'. <=== src/modules/php4 <=== src/modules gcc -c -I./os/unix -I./include -DLINUX=22 -I/home/evan/CMS/php-4.0.6 -I/home/evan/CMS/php-4.0.6/main -I/home/evan/CMS/php-4.0.6/main -I/home/evan/CMS/php-4.0.6/Zend -I/home/evan/CMS/php-4.0.6/Zend -I/home/evan/CMS/php-4.0.6/TSRM -I/home/evan/CMS/php-4.0.6/TSRM -I/home/evan/CMS/php-4.0.6 -DNO_DL_NEEDED ./apaci modules.c gcc -c -I./os/unix -I./include -DLINUX=22 -I/home/evan/CMS/php-4.0.6 -I/home/evan/CMS/php-4.0.6/main -I/home/evan/CMS/php-4.0.6/main -I/home/evan/CMS/php-4.0.6/Zend -I/home/evan/CMS/php-4.0.6/Zend -I/home/evan/CMS/php-4.0.6/TSRM -I/home/evan/CMS/php-4.0.6/TSRM -I/home/evan/CMS/php-4.0.6 -DNO_DL_NEEDED ./apaci buildmark.c gcc -DLINUX=22 -I/home/evan/CMS/php-4.0.6 -I/home/evan/CMS/php-4.0.6/main -I/home/evan/CMS/php-4.0.6/main -I/home/evan/CMS/php-4.0.6/Zend -I/home/evan/CMS/php-4.0.6/Zend -I/home/evan/CMS/php-4.0.6/TSRM -I/home/evan/CMS/php-4.0.6/TSRM -I/home/evan/CMS/php-4.0.6 -DNO_DL_NEEDED ./apaci \ -o httpd buildmark.o modules.o modules/standard/libstandard.a modules/php4/libphp4.a main/libmain.a ./os/unix/libos.a ap/libap.a -Wl,-rpath,/home/evan/CMS/XML/lib -rdynamic -L/home/evan/CMS/XML/lib -Lmodules/php4 -L../modules/php4 -L../../modules/php4 -lmodphp4 -lpam -ldl -lgd -ljpeg -lz -lxml -ldb -ldb2 -lgdbm -lz -lcrypt -lresolv -lm -ldl -lnsl -lresolv -lm -lcrypt -lexpat make[2]: Leaving directory `/home/evan/CMS/apache_1.3.22/src' make[1]: Leaving directory `/home/evan/CMS/apache_1.3.22' modules/php4/libphp4.a(php_domxml.o): In function `php_xpathptr_new_context': /home/evan/CMS/php-4.0.6/ext/domxml/php_domxml.c:1607: undefined reference to `xmlXPtrNewContext' modules/php4/libphp4.a(php_domxml.o): In function `php_xpathptr_eval': /home/evan/CMS/php-4.0.6/ext/domxml/php_domxml.c:1670: undefined reference to `xmlXPtrEval' collect2: ld returned 1 exit status make[2]: *** [target_static] Error 1 make[1]: *** [build-std] Error 2 make: *** [build] Error 2 ------------------------------------------------------------------------ Edit this bug report at http://bugs.php.net/?id=14075&edit=1

« previous php.dev (#70607) next »