Bug #14243 Updated: make install generates errors from shtool in pear subdir

From: Date: Tue, 27 Nov 2001 13:44:59 +0000
Subject: Bug #14243 Updated: make install generates errors from shtool in pear subdir
References: 1  Groups: php.dev 
Request: Send a blank email to php-dev+get-71788@lists.php.net to get a copy of this message
ID: 14243 Updated by: sniper Reported By: yusufg@outblaze.com Old Status: Open Status: Closed Old Bug Type: *Compile Issues Bug Type: Compile Failure Operating System: Linux 2.4.14 Redhat 7.0 PHP Version: 4.0.6 New Comment: These are fixed in CVS and PHP 4.1.0. And if you're not running 'make install' as root and you're trying to install into some location where you don't have write permissions, it will never work. --Jani Previous Comments: ------------------------------------------------------------------------ [2001-11-27 00:15:16] yusufg@outblaze.com Configure command ./configure --prefix=/usr/local/site/php --with-apache=../apache_1.3.22 --enable-track-vars --with-pear=/usr/local/site/pear --with-config-file-path=/usr/local/site/php Running make ; make install Gives the following result make[1]: Entering directory `/var/tmp/php-4.0.6/pear' make[2]: Entering directory `/var/tmp/php-4.0.6/pear' shtool:mkdir:Error: invalid number of arguments (at least 1 expected) shtool:mkdir:Hint: run /usr/tmp/php-4.0.6/build/shtool mkdir -h' or man shtool' for details +----------------------------------------------------------------------+ | The installation process is incomplete. The following resources were | | not installed: | | | | Self-contained Extension Support | | PEAR: PHP Extension and Add-on Repository | | | | To install these components, become the superuser and execute: | | | | # make install-su | +----------------------------------------------------------------------+ make[2]: *** [install-data-local] Error 5 make[2]: Leaving directory `/var/tmp/php-4.0.6/pear' make[1]: *** [install-recursive] Error 1 make[1]: Leaving directory `/var/tmp/php-4.0.6/pear' make: *** [install-recursive] Error 1 ------------------------------------------------------------------------ Edit this bug report at http://bugs.php.net/?id=14243&edit=1

« previous php.dev (#71788) next »