Bug #14532 Updated: streams.c:285: warning: initialization from incompatible

From: Date: Sat, 05 Jan 2002 21:52:03 +0000
Subject: Bug #14532 Updated: streams.c:285: warning: initialization from incompatible
References: 1  Groups: php.dev 
Request: Send a blank email to php-dev+get-75989@lists.php.net to get a copy of this message
ID: 14532 Updated by: lobbin Reported By: j_phatt@hotmail.com Old Status: Feedback Status: Closed Bug Type: Compile Failure Operating System: RedHat 7.2 PHP Version: 4.1.0 New Comment: No feedback. Closing. Previous Comments: ------------------------------------------------------------------------ [2001-12-15 06:40:07] derick@php.net What is your configure line, so that we can try to reproduce this? regards, Derick ------------------------------------------------------------------------ [2001-12-15 02:04:05] yohgaki@php.net strearms is highly experimental, but thank you for reporting. Wez? are you around? IIRC it's yours ;) ------------------------------------------------------------------------ [2001-12-15 01:53:28] j_phatt@hotmail.com Making all in main make[1]: Entering directory `/data/sw/.zip/php-4.1.0/main' make[2]: Entering directory `/data/sw/.zip/php-4.1.0/main' /bin/sh /data/sw/.zip/php-4.1.0/libtool --silent --mode=compile gcc -I. -I/data/sw/.zip/php-4.1.0/main -I/data/sw/.zip/php-4.1.0/main -I/data/sw/.zip/php-4.1.0 -I/opt/apache/include -I/data/sw/.zip/php-4.1.0/Zend -I/usr/include/freetype2/freetype -I/usr/include/imap -I/usr/local/mcal/include -I/opt/mysql/include/mysql -I/usr/include/pspell -I/usr/include/ucd-snmp -DLINUX=22 -DUSE_HSREGEX -I/data/sw/.zip/php-4.1.0/TSRM -g -O2 -prefer-pic -c streams.c streams.c:285: warning: initialization from incompatible pointer type streams.c: In function `php_stream_cast': streams.c:340: parse error before `static' streams.c:346: `cast_names' undeclared (first use in this function) streams.c:346: (Each undeclared identifier is reported only once streams.c:346: for each function it appears in.) make[2]: *** [streams.lo] Error 1 make[2]: Leaving directory `/data/sw/.zip/php-4.1.0/main' make[1]: *** [all-recursive] Error 1 make[1]: Leaving directory `/data/sw/.zip/php-4.1.0/main' make: *** [all-recursive] Error 1 ------------------------------------------------------------------------ Edit this bug report at http://bugs.php.net/?id=14532&edit=1

« previous php.dev (#75989) next »