Bug #721: Error during apache compilation due to php module
| From: | nicolas at info dot unicaen dot fr | Date: | Fri, 04 Sep 1998 07:26:12 +0000 |
| Subject: | Bug #721: Error during apache compilation due to php module | ||
| Groups: | php.dev | ||
| Request: | Send a blank email to php-dev+get-794@lists.php.net to get a copy of this message | ||
From: nicolas@info.unicaen.fr
Operating system: Linux 2.0.35
PHP version: 3.0.3
PHP Bug Type: Compile Failure
Bug description:
Error during installtion of php module in apache :
modules/php3/libphp3.a(main.o): In function `php3_printf':
/mnt/data1/php-3.0.3/main.c:272: undefined reference to `charset_vbprintf'
make[2]: *** [target_static] Error 1
make[2]: Leaving directory `/mnt/data1/apache_1.3.1/src'
make[1]: *** [build-std] Error 2
make[1]: Leaving directory `/mnt/data1/apache_1.3.1'
make: *** [build] Error 2
--
PHP Development Mailing List http://www.php.net/
To unsubscribe send an empty message to php-dev-unsubscribe@lists.php.net
For help: php-dev-help@lists.php.net