PHP 4.0 Bug Summary Report

From: Date: Sat, 13 Apr 2002 16:01:09 +0000
Subject: PHP 4.0 Bug Summary Report
Groups: php.dev 
Request: Send a blank email to php-dev+get-82760@lists.php.net to get a copy of this message
PHP 4.0 Bug Database summary - http://bugs.php.net Num Status Summary (1845 total including feature requests) ===============================================[*Compile Issues]============== 14672 Open confusion about --enable-ucd-snmp-hack ===============================================[*Configuration Issues]======== 13561 Suspended --without-pear prevent install of php-config,phpize,... 14048 Open Configure issues 14452 Open libphp4.so is not linking with *.la files 14682 Open OpenSSH extension buildable as a loadable module only by chance 15121 Open main/.libs/libmain.al(main.lo) in archive is not object 15172 Open The file config has a hard-coded version number for BerkeleyDB (BerkeleyDB3.0) 15182 Open php.ini seems to have no affect 15215 No Feedback Wrong path for php.ini under Windows XP (Home and Professional) 15264 Open unable to include self when loaded as module 15377 Open php.ini is not in right location 15453 Open PhP fails to find mcrypt API 15474 Feedback configure: error: cannot find output from lex; giving up 15823 Feedback Configure fails (line 3395 unexp. 'fi') 16138 Open .htaccess / httpd.conf and error_reporting constants 16184 Feedback Crashes during ./configure script 16251 Open config.guess returns value incompatible with configure 16311 Feedback php.ini-dist and php.ini-recommended missing extensions ===============================================[*Directory/Filesystem functions] 12004 Analyzed problem with fopen over ftp and a related fgets 12783 Open xmlDocFile needs absolute path 13764 Open No error in filename.phtml 14049 Open Inconsistent return in realpath 14076 Feedback fopen() and touch() fail to create file under safe mode 14100 Open Unicode Filenames 14657 Analyzed Sometimes mkdir("test1", "0777"); $d=dir("test1"); $d->close(); rmdir("test1"); 15185 Feedback Exploring the server recources witch php 15260 No Feedback file_exists doesn't work with 2G+ files 15634 Open Problem with opendir function ===============================================[*Extensibility Functions]===== 15125 Open pnctl_signal does not handle class's as callbacks - patch included ===============================================[*General Issues]============== 13818 Feedback safe mode wrong uid -1 14200 Open remote navigation problem 15651 Open Output is broken 15660 Open PHP 4.1.1 as Apache module works not properly with Internet Explorer(WindowsXP) 15854 Open allow_url_fopen setting in php.ini ignores the false INI constants 15861 Open bad build tool 15926 Feedback sum error 16045 Feedback count($array) logical error 16094 Feedback Unable to view .php file in the browser 16186 Open include path in the module version, using sub dir as php causing error 16388 Open empty output with "echo <<<..." ===============================================[*Graphics related]============ 13508 No Feedback read exif data not working on large thumbnails 15662 Open iptcembed FotoWare ===============================================[*Install and Config]========== 7809 No Feedback ld: 0711-317 ERROR: Undefined symbol: .alloca ===============================================[*Languages/Translation]======= 13014 Open hebrevc () ===============================================[*Mail Related]================ 6742 Feedback mail function fails 15841 Open CRLF to separate mail headers is incorrect ===============================================[*Math Functions]============== 15732 Feedback gmp_init fails to create gmp resource ===============================================[*Network Functions]=========== 15639 Feedback detecting end of UDP packets 15988 Open Pending established tcp connections ===============================================[*PDF functions]=============== 15243 Open Compile Error - make[3]: *** [pdf.lo] Error 1 ===============================================[*Programming Data Structures]= 16304 Feedback Missing Error Messages ===============================================[*URL Functions]=============== 14842 No Feedback fopen ===============================================[*Web Server problem]========== 16013 Open max execution time reached with slow connection ===============================================[Apache related]=============== 8865 Open App launching with hotkeys delayed 8866 Open Frozen applications with apache module running 9280 Open HTTP/1.1 Expect: header not honoured 9422 Open Apache hangs when Win goes to standby 10060 Open startup error msg format 10075 Open Exta path information beyond the PHP script won't work with CGI 11716 Open Segmentation fault(coredump) in Apache(DSO-enabled) startup 12210 No Feedback DirectoryMatch/php_value/.htaccess 12683 Open Safe mode (apache with mod_perl) uses incorrect uid 12992 Open php ignores Accept: text/vnd.wap.wml 13035 Open 404 on a .php results in SERVER ERROR when using php as a cgi 13420 Open open_basedir breaks Apache SSI xbithack 13421 Open Problematic MIME-Type "application/x-httpd-php" 13925 Analyzed SCRIPT_NAME in Apache 1.3.22 wrong (or at least different) 13956 Open improve robustness against bad signal(2) et al. calls from third party libs 13961 Assigned some characters in incomonig variable names are silently changed 13964 Open core dump on AIX 4.3.2 13982 Open set_time_limit (ref #13711) and ignore_user_abort affects later requests 14222 Open PHP Crashes with weird output often 14229 Open function "virtual" 14245 Open make install fails on apxs 14265 Open Make does not create php4lib.so. Apxs fails to copy it to apache dir 14348 Open Major PHP memory corruption? (with testcase) 14351 Open problems installing PHP as a DSO 14370 Open PHP_AUTH_PW being improperly set 14401 Open Wrong include_path from Apache <Directory> config 14409 Open request for nonexistent file does not return 404 error 14534 Open Variables $PHP_AUTH_* is set, when use a traditional external auth mechanism 14662 Open Apache segvs on SIGHUP 14689 Open apache fails to load php due to mmap failure 14716 No Feedback PHP 4.1.1 DSO: apache startup fail 14764 Open Apache Error when calling enclosed function 14865 Feedback php4apache.dll - phpinfo error - winXP - Apache 14881 Open Apache fails to start after PHP compile 14956 Open --with-imap-ssl hand apache start with libssl.so 15038 Open replace parameter of Header() function doesn't work in Apache module 15053 No Feedback Floating point exception 15275 Open Apache 1.3.20 won't start with newly compiled PHP 4.1.1 15295 Feedback apache php freebsd can't upload parameter 15469 Open data corruption in apache logs 15476 Open corrupted outputs when using PHP as Apache Module under Windows XP 15507 Open Fails to compile with newest Apache 1.3.23! 15529 Open ap_cleanup_for_exec not used when creating 15531 Feedback Apache doesn't start 15579 Open Segmenation fault 15588 Open Segmentaion fault 15747 Open Undefined symbol "_mail_string" 15773 Analyzed LoadModule directive incorrectly added to httpd.conf when mod_ssl is used 15820 Feedback Apache 1.3.23, MySQL Client 3.23.49, PHP 4.1.2, same error with PHP 4.1.1 befor 15873 Feedback special build error with apache using php module after system-compoment changed 15935 Open phpinfo routine mixing SCRIPT_URI and SCRIPT_URL 15940 Open Segmentation fault (11) 15954 Open problem on shutdown/oleaut32.dll 15963 Feedback SSL pags fail using some versions of Netscape 15968 Open make error when making apache 15970 Open fpassthru problem on Apache 1.3.23 (module) 16052 Open Some predefined variables allow GET overwrite 16233 Feedback Apache crashes on header() 16241 Feedback make apache error 16248 Open "Inclusion error" with Apache 1.3.24 and PHP 4.1.2 (VirtualHost set) 16315 Feedback Problem with NameVirtualServer 16416 Feedback Unable to load Dynamic Libraries when mod_ssl enabled 16425 Feedback Undefined symbol in libphp4.so 16453 Open include_path in httpd.conf dosn't take effect when php installed Static 16515 Open Files with execute-bit are always php-parsed - I cannot disable this! 16580 Feedback Apache Hang On ===============================================[Apache2 related]============== 14594 Open Failed to compile/run when using Apache 2.x, unresolved symbols 14637 Feedback Apache 2.0 filter and PHP 4 crash 14999 Open apache_lookup_uri returning array for apache2 instead of object 15126 Open Segfalt on startup when compiled with oci8 15591 No Feedback Apache2 (compiled w/-lpthread) + PHP4 + OCI8 + Mandrake8.1= Segmentation Fault 15703 Open Segmentation fault with apache2 php pages not served 15792 Feedback sapi_apache2.c:247 15859 Open Apache crash when using apache2filter and latest CVS 16104 Open Apache2 segfault on startup in TSRM/TSRM.c:310 16218 Feedback The PHP Filter did not receive suitable input data 16489 Open php_admin_value not allowed in virtualhost 16583 Open php 4.2.0RC3 always crashes apache 2.0.35 server at start ===============================================[Arrays related]=============== 7045 Open Shuffle() does not behave correctly 10264 No Feedback strange associative array behaviour 10449 No Feedback shuffle() function crashes PHP 10658 Suspended array_diff does not work with classes 13289 Assigned array_map segfault 14160 Open associative arrays - cannot use exclamation mark in key! 14580 Open Incorrect behavior with key containing NULL byte 14591 Open uasort mixes array with equal elements 14738 Analyzed array_pad dies with large pad length 14791 Open Array_shift always the problem ... 14795 Open array_sum() modifies the specified array 14805 Assigned array_unique works opposed to the manual 14917 Open When using array_merge w/numbers & assoc array the numbers are changed to 0,1.. 14990 Open array_merge_recursive modifies inputted value 15273 Open Reference to array breaks 15520 Open array_slice destroys numeric keys 16063 Open array_pop() causes core dump, can be used to reveal information 16064 Open array_merge_recursive() can be used for DoS 16065 Analyzed print_r() and var_dump() infinite loop. 16068 Open array_shft() core dump. problem similart to #16063 16071 Open foreach return bogus data on 1 row multi-dim array 16072 Open compact() causes core dump 16096 Feedback Gettype reports var as string; echo complains as array and it is an array 16269 Analyzed array_splice produces an unexpected result 16322 Open Page stops loading when processing arrays in foreach cycles inside functions ===============================================[BC math related]============== 13551 Open BC functions apply decimal places argument also on arguments 16532 Open locale information (LC_NUMERIC) not used in bcmath functions ===============================================[Calendar related]============= 13187 Open Concerning jdtounix() function 15379 Open unixtojd() doesn't return the correct date. ===============================================[CCVS related]================= 10447 Suspended ccvs_*() functions segfault when given invalid session ID ===============================================[Class/Object related]========= 12622 Analyzed scope of $this and static functions 14626 Open calling a method "magically" turns the object into a reference to itself 14670 Open no warning on accessing an array element of an object 15402 Open include of parent class 15576 Open Got "Warning: Problem with method call. Report this bug in xxx.php" error 15675 Suspended get_class() returns only lower chars 16334 Open memory leak when passing object ===============================================[ClibPDF related]============== 10393 Analyzed CPDFlib support not compile as module 12577 Open cpdf_import_jpeg() not working at all ===============================================[COM related]================== 12736 Open ? just found :) 13356 Open ADODB Recordset issue 14334 Open Bug in COM class 14353 Open can't set CP_UTF8 codepage 15043 Open Dr. Watson Excel COM Instance 15205 No Feedback ADODB.Recordset PropPut() failed: 15543 Open using com_* versus new COM(...) and error reporting 15635 No Feedback COM Singleton 15771 Suspended cannot pass value to image field by ado 16375 Open Feature: Support for VARIANT multi dimensional arrays 16567 Open out parameters unchanged in PHP ===============================================[Compile Failure]============== 7643 Open APXS compile fails with "not a DSO" 10108 No Feedback cc 1501:218 file XXX contains an incorrect file suffix 12063 Open "make install" fails on cp lib/libphp4.so 12302 Open timezone,struct statfs,linking 12445 Feedback ./configure suxx 13519 Suspended Filename "time.h" conflict in VS.NET 13695 Open Compilation fails when trying to compile with DB2 Support 13798 No Feedback Compilation error with oracle 13814 Open missing required flags for Compaq compiler 14271 Open Failure to compile using GD 2.0.1 because of conflicting types for gdIOCtx 14431 Open my_getwd.c:62: #error "No way to get current directory" 14891 Feedback Additional libraries directories missing during compilation 14904 Open configuring apache with php4 14910 Open --with-snmp compile failure 14936 Open Apache compilarion failure in the php module 14941 Open Trying to build PHP. attached is the configure output and the error message. 14959 Open Compiling error with FreeBSD 4.4-STABLE 14970 Open make terminates in informix-part because of doubly defined decimal.h 14977 Open iconv library not propagated from PHP to Apache 15034 Open LDAP symbols multiply-defined 15059 Open compile fails when I add cyrus support 15067 Open unresolved external symbols 15076 Open Name conficts when some libs are static. 15112 Feedback failed to compile extension modules as a dso 15177 Critical Informix Shared Module will not compile 15206 Open compile fail with external mysql without with-zlib option 15207 Open Failure to compile with LDAP support 15270 Open make install fails 15271 Open Unable to compile because of /usr/ccs/lib/libgen.a 15346 Analyzed mysql mnogosearch - php & static libs 15364 Open Compile Fails as CGI with INFORMIX on SCO 15436 Open mnogosearch & mysql - gamble party 15452 Feedback undefined reference to `dn_skipname' 15461 Open configure fails for extension samples 15492 Feedback ./configure ends with failure 15559 Open ./.libs/libphp4.a(zend_ini_scanner.o)(.bss+0x10014): multiple definition of `yy 15561 Open make install fails to copy libphp4.so 15569 No Feedback make problems 15587 Feedback basic_functions.c and dns.c fail to compile due to incompatible parameters 15610 Open cracklib test path is wrong in configure file 15623 Open build script fails to link "nss_dns" library 15674 Open Error compiling standard/mail.c 15742 Feedback zend_language_scanner.c :2819 Intenal Error 15759 Feedback pgsql.c void value not ignored as it ought to be 15763 Open Compile failure 15776 Open imap compile failure 15781 Open Reentrancy.c fails to compile 15798 Open unresolved symbol __log1p 15803 Open Informix + IBM DB2 = Compile Failure 15814 Open php 4.1.2, apache 1.3.20, parse error near 'zval' 15908 Open failed to compile with iconv 15931 Analyzed openssl linking error:undefined reference to `OPENSSL_add_all_algorithms_noconf 15959 Open config.status - empty case/esac statement 15964 Open php_cli.c:580: undefined reference to 'zend_strip' 15986 Open Mac OS X support (target: 4.2.0) 16009 Feedback Apache/SAPI Compile Error 16011 Open --with-bcmath link error 16098 Feedback Output line too long 16100 Open SAPDB Compile Failure 16117 Open php.h / ap_config.h conflict (XtOffsetOf) 16135 Feedback Release breaks due to C++ requirement 16252 Feedback try to link the wrong iconv lib when compiling with xmlrpc 16324 Open compling file zend_language_parser.c error! 16365 Open make[3]: *** [filestat.lo] Error 1 16414 Open Unable to compile the fribidi extension 16467 Feedback ./configure fails with strange message 16519 Feedback makefile error 16534 Open compilation failed on inline function url_scanner.c 16552 Feedback Undefined macro `AC_PROG_LIBTOOL' 16584 Open GD compile failure ===============================================[Compile Warning]============== 12034 No Feedback A type-error and a coding-error. 14619 Open Number doesn't fit the data type 15147 Open why have so bugs in make ,Have some bugs in Zend? 15593 Feedback still getting inter-libraray dependencies warning 15914 Open *lots* of compiler warnings... ===============================================[cURL related]================= 15862 Open Reborn bug: "error is SSL: couldn't create a context!" 15989 Feedback php is segfaulting when trying to read http header of a ftp.domaine.com site ===============================================[Cybercash related]============ 8255 No Feedback CyberCash support not correctly installed ===============================================[Date/time related]============ 10686 Feedback Bug in "mktime()" on values out of bounds 12474 Open possible incorrect strtotime handling of "-1Month" 12934 Open strftime() doesn't grok negative time_t 13142 Analyzed strtotime() returns -1 for "M d H:i:s Y" format 14391 Open gmmktime, gmdate work incorrect 14828 Open Timezone on mail timestamp early by 12 hours 15005 No Feedback Date bug with two and four digit year 15115 Open strtotime not recognizing 'Sa' as Saturday 15123 Open strtotime doesn't work with long date format 15194 Open date("m-d-y H:m:s", $timestamp) doesn't jive with system time 15291 No Feedback date() function time return problem 15362 Open date("r") returns wrong timezone offset, can cause crash 15557 No Feedback Date Command date("Y-m-t"); Not Correct with system time 15584 Analyzed strftime("%D") problem 15815 Open date() shifting time 16236 Open GetTimeOfDay returns minuteswest as seconds 16429 Open strtotime fails when crossing Daylight Saving Time 16451 Open strtotime with CEST timezone set returns -1 16517 Open strtotime no longer converts output of UNIX command 'date' ===============================================[DBM/DBA related]============== 8819 Open dbm functions do not work correctly 9222 Open dbmreplace() and dbmdelete() don't run 9283 Open Serialized data gets corrupted in DBM 9934 Open faulty dbmfetch() 9994 Open dbmfetch 12020 Open dbm insert and replace functions inserting incorrect values. 12418 Open ndbm - driver initialization 12867 Open lack of DBM function on all platforms 13630 Open GDBM writes frequently fail during heavy traffic. 13660 Open store extra data in db file on create 13876 Open Not possible to build DBA as shared extension 14383 Assigned using postgres with DBA causes DBA not to be able to find any keys. 15287 Open dba_popen replace inserts never get written. 15664 Open dba_firstkey() isn't returning the first key 16190 Open DBM Support on Windows truncates values 16424 Open dba_*open "c" mode broken again ===============================================[Directory function related]=== 15153 Open Php starts writing log in an infinite loop resulting is system DoS 15706 Open readdir doesn't return correct FRENCH filenames 16257 Open is_dir enters infinite loop 16368 Feedback Error with is_dir() ===============================================[Documentation problem]======== 3783 Assigned versioning + mysql impossible ! 8128 Open more descriptive parse error reports 8536 Open ob_start() is not working with virtual() function 8969 Analyzed Gettext does not work 9914 Analyzed session_id loss with redirection via header() method 9983 Open Operator Precedence Clarification/Additions 9986 Open Insufficient Windows installation instructions 10172 Open get_class() doesn't return lowercase for DomX objects 10374 Open Depreciated features or not 10528 Open I have been unable to find any documentation on the SAPI interface. 10636 Open php_oci8.c -- undefined constants 11220 Analyzed special chars insertion into oracle / NLS_LANG 11598 Open Configuration section doesn't distinguish between admin and user values. 11618 Analyzed session and form data 11789 Open Apache can't start: Sybase-ct & LC_ALL 11803 Analyzed call to undefined function not caught by set_error_handler 11940 Open ill side effect of open_basedir 12212 Assigned iSilo PDB documentation seems to be broken 12324 Analyzed arg_separator.output broken 12337 Open Function fscanf does not correctly handle "\t" in format string 12454 Open Static references are transient inside methods 12706 Analyzed parse_url misbehaves 12759 Open What's new 12839 Open Descrepancy in Manual (Appendix G) 12864 Open flag \\Recent isn't settable 12868 Open Appendix G Descrepancies.. 12885 Analyzed don't agree to the persistent connection manual section 13165 Analyzed Definate problem with classes and included files 13279 Open parse_ini_file causes PHP to exit if ini file syntax is malformed 13292 Open file_exists works with UNC names 13321 Open Documnetation 13577 Open is_null evaluates true for non-existent variables 13645 Analyzed variables_order influences HTTP_*_VARS 13774 Open Missing information in isapi installation for apache 13777 Open Specifying alternate directory for php.ini with PHPRC env. var missing 13794 No Feedback Unclear to PHP novice: minimum necessary config for "hello" 14094 Open Documentation for @new is missing 14219 Open Various documentation suggestions 14260 Open $HTTP_RAW_POST_DATA Manual Update 14361 Open Unreadable PDB format 14418 Assigned PHP and HTML FAQ should be improved 14447 Open Thread Safe 14460 Open no bookmarks in PDF version 14472 Open predefined variables update 14595 Open Iplanet Webserver 6.0 related 14663 Suspended Empty packets as result of serialization 14732 Open Broken links in global.ent 14752 Open missing changelog item 14804 Open PHP_AUTH_* - what is it? 14839 Open getcwd() and pwd, PHP behaviour nor clearly documented 14965 Open Sablotron XLST encoding error 14984 Open php parser problem, with // comment, can reveal script 14992 Open Behaviour of $array = $array1 + $array2; not documented 15110 Open session_start() 15116 Open Rendering/naming Problem 15152 Open SSI output from PHP CGI produces garbage on Netscape browsers 15157 Analyzed exec()/system() doesn't work with parameters in quotation-marks in system-call 15166 Open preg_replace issue when \\1 is followed by 1 15222 Open 4th param in session_set_cookie_params 15230 Open memory_limit not obviously disabled for windows binary 15240 Open saving includes as unicode in Interdev produces partial or erratic including 15278 Open documentation error on ifx_query() 15427 No Feedback Online and offline documentation completely different! 15603 Analyzed PHP output sometimes doesn't follow HTML 4.01 standards. 15609 Open missing directive in documentation 15617 Open assert description doesn't fit it's designation 15637 Open if using URI, ldap_connect() returns resource ID when server does not exist 15661 Open Corporate Name Change 15695 Open Documentation http title string 15714 Open Variables from outside PHP page doesn't mention new $_* arrays 15721 Open PDF Documentation has no bookmarks 15767 Open Build instructions for Win32 incomplete 15806 Open DirectIO documentation lacking 15836 Open Bug #11162 pfsockopen closes connection after script finishes ! 15904 Open Return value of eval() 15915 Open the sample code have some wrong on Creating Extensions 15916 Open wrong compile command sample on Chapter 28. Creating Extensions 15929 Open Online Manual Inconplete 15944 Analyzed imap_sort Error 15980 Analyzed can't install php4 16083 Open Index missing in page-per-function HTML docs 16228 Open XSLT file path issues 16234 Open important language features only mentioned in passing 16239 Open Downloadable PDF is trucated at Chapter 46 16245 Open Static variables into class member funtions have wrong scope 16290 Open Specify that --with-apxs requires installed apxs 16294 Open Pages loading slowly 16366 Open bit shifting error 16377 Open allow_url_fopen = Off cuts the ability to open php://* 16397 Open domxml_unlink_node() 16398 Open Eng. chm: "Predefined constants" is missing 16479 Open var declaration in class has no meaning? ===============================================[DOM XML related]============== 14850 No Feedback Problems with XML and DTD entities 15949 Open replace_node feature 15966 Open replace_node incorrect 16154 Feedback unlink() is causing php.exe process to keep running 16204 Open append_child related 16344 Open GTK causes DOM xmldoc to fail 16420 Open new_child not working properly ===============================================[Dynamic loading]============== 2220 Assigned dynamic module memory leaks cause SIGSEGV under DEBUG mode 8981 Analyzed Apache fails to load PHP module 9822 Open -R ld option not being pass thru libtool 10488 No Feedback --with-regex=apache fails to resolve php_regcomp when loading Apache 11668 No Feedback Oracle and MS-SQL cannot co-exist 13857 Open Attempting to load shared modules causes header problems. 14029 No Feedback can't dynamically load php_printer.dll extension 14940 Open FastCGI SAPI prefork a number of processes 15193 Open Module loads but does not work 15838 Open Gettext library not linked in correctly? ===============================================[FDF related]================== 14877 Open HTTP_FDF_DATA not available ===============================================[Feature/Change Request]======= 979 Open [PEAR] Openmarket Transact support 1029 Assigned printf (& sprintf) dosn't handle exponential format for floats correctly 1571 Open support for mknod(): pipe creation 1658 Open Enhance Sybase-ct to fetch limited rows 2107 Open Exec as TTY 2328 Open I would like animated gif support within php. 2352 Analyzed Create subgroup of database functions 2541 Open dl(string name) should not require the file extension for the module name 2807 Open LOB descriptors with Fetch/Result and FetchInto 3066 Open Parameter for dns functions to select different DNS 3275 Analyzed [PEAR] ICQ support 3276 Assigned Add PGP support 3367 Open PHP code callback during file upload 3462 Analyzed foreach behavior on a non-array 3697 Analyzed open_basedir prevents creating files with fopen 3799 Suspended default_charset brings small incompatibility 3830 Open Function to timeout/break off a function 3928 Open shorthand notation for filling associative arrays, please 4089 Suspended No bug, only a suggestion 4223 Analyzed PHP calls MySQL with apache user instead of connected user 4426 Open php when run w/ binfmt_misc does not work w/ apache 4612 Suspended Too much of $this 4856 Open have get_browser() not relying on external browscap.ini 4875 Open array_merge() is unable to merge arrays with numeric keys 5007 Analyzed enable no-resolve mode for here docs 5050 Analyzed $php_errormsg not changed on errors inside functions 5142 Open Allow properties and methods of a class to be declared as public or private 5153 Open fopen("http://...") has no timeout 5169 Open Missing recursive behavior 5174 Open OCIBindByName doesn't need quoting in strings 5226 Analyzed arrayfields reorganized when using array_pop 5301 Open cosmetic change in phpinfo() output 5311 Analyzed Checkdnsrr 5343 Open a way of implementing class methods 5435 Open Request to update eval() or create new function. 5563 Analyzed Change session.cache_expire value to be in seconds 5575 Open open_basedir to ~ 5601 Analyzed @function() should not turn of error reporting for critical errors 5682 Open Allow connection string in place of DSN for ODBC connections 5748 Open Suggestion for Installation 5804 Open parser error if any spaces follow indentifier in with here doc syntax 5883 Assigned --enable-trans-sid modification request 5889 Analyzed pack() does not take arrays 5954 Open Informix can't reliably figure if a text result column is NULL 5960 Open Output buffering and headers 5975 Open enhancement of strip_tags needed 6019 Analyzed Error with equal operator when comparing certain values 6082 Open User defined error handler should be avare if function was prefixed with @ 6090 Open fseek() returns -1 (not false) if an error occurs. 6107 Analyzed increments are magic, decrements not 6118 Open Can not supress runtime warnings on foreach 6193 Analyzed new object makes a shallow copy 6222 Open ora_fetch_array? 6238 Analyzed var_dump() param for deactivating reference following 6268 Open ternary op return only by value 6305 Analyzed when string contains "at", wrong time returned 6310 Open Connect to ACCESS DB without a DSN 6339 Analyzed invalid Sybase-link resource - problem with last opened link 6343 Open enable pass by reference to be optional 6399 Open checkdate should be able to validate a time as well as a date (timestamp) 6418 Open Multiple class extends ordering error 6427 Open func_get_arg() does not support references 6503 Open no support for multiple resultset query? 6512 Analyzed sort() Does not sort stings as expected 6513 Open get_browser() and $HTTP_USER_AGENT 6563 Open OCIPLogon should check the connection 6574 Open SMTP functions via IMAP c-client library 6584 Open SNMP "get-next" function is missing 6680 Open regexps (ereg*) ignores locale settings 6701 Open Use of http_proxy for fopen("http:// ... 6746 Open Support for Sybase bcp and large result sets 6771 Open Import LIB files needed in Win32 distribution 6911 Open Problem with array_merge(_recursive) 6927 Suspended 6932 Open Filesize / File_exists and include_path 6982 Open disable_functions option don't works in Apache config 6989 Open imap_sort interprets headers 6993 Open uninstalling is a pain in the ass 7006 Open preg_replace ( string pattern, array replacement, string subject ); 7028 Analyzed xml=shared and wddx do not work together 7095 Open Unwanted content-type header 7121 Open fopen() doesn't owerwrite files opened via a FTP connection 7132 Open fsockopen doesn't report dns lookup failure 7220 Open Error Report on Function Arguments 7354 Open Feature Request: sort on single element arrays 7398 Open Stored procedure error return values not passed through 7440 Open Print function calling stack 7507 Open Better ODBC error reporting/fetching 7535 Open Entities missing in get_html_translation_table ( HTML_ENTITIES ); 7541 Open please consider also support HPUX shl_* 7553 Open RFC: Uplevel Block structure 7559 Open zend_hash_get_current_key_ex returning persistent strings 7568 Open 64-bit integers, 32-bit unsigned and 64-bit unsigned 7578 Open next() and current() do not return referenceing arrays 7629 Assigned Mail() fails when the email message has a "\n" 7741 Open .cgi does not adhere to quasi-RFC 7765 Open not OO until automatic class destructor is added 7782 Assigned Cannot use PATH_INFO fully with php isapi 7805 Open Add optional parameter 'class' to mysql_fetch_object() 7808 Open variable value triggerd by function 7829 Open hex2bin()? 7869 Open parse_str produces no trapable value 7923 Open htmlentities doesn't work for ISO 8859-2 7930 Open List() constructor reference assignment 8006 Open raw_mail() function 8009 Open mysql_fetch_array and same Column Name 8017 Open PHP ignores "If-Modified-Since" headers 8070 Open wish list: oci8.max_persist in php.ini 8074 Open IPTC parse 8075 Open Make Function/Method return value a "direct" object 8100 Assigned extract(), extra feature 8108 Analyzed implement trans-sid as output handler 8187 Open Partial FTP Downloads 8194 Open Need for a "const" qualifier. 8217 Open long2ip gives 127.255.255.255 result instead of correct value 8218 Open str_replace() with count of replacements 8282 Open Is there a function for this? 8290 Analyzed allow func_*_arg?() functions as function parameters inside a function 8295 Open absolute path in extension= directive in php.ini not recognized 8325 Open numeric strings used as keys are converted to longs 8328 Open ucwords and ucfirst misbehaving with quotes 8395 Open register_shutdown_function() error 8397 Open Multi-results sets are not suppported 8427 Open Unwanted references 8428 Open continue doesn't pass thru a switch statement 8577 Open i would kill for the ability to undefine() 8595 Open More effective parsing of list() (+other) 8640 Open enumeration type 8644 Open Include Signal catching for parse errors 8796 Analyzed "$foo->bar->baz" ambiguity in double quoted strings 8809 Open Cookieless session with Header redirects 8817 Suspended $foo->getbar()->getfoobar()->method() 8827 Open PHP_AUTH_PW stores password when using External Authentication 8849 Open open_basedir doesn't apply to function 'copy' 8855 Open session_start should return also FALSE 8860 Open variable array not working 8879 Open iPlanet: setting doc_root etc. for virtual servers 8897 Open Significant portions of the InterBase API have no PHP representation. 8948 Open readline_completion_function enhance 8960 Open Request for a more flexible Metaphone function 8963 Open using shared PHP libraries in safe_mode 9022 Open Selectable option for PHP_AUTH_PW 9035 Open Need a PHP_AUTH_REALM built-in variable 9095 Open colon/semicolon delimitd extension_dir ? 9117 Assigned output_handler = ob_gzhandler 9155 Open set_error_handler() to accepts object/method tuple 9173 Open getline 9195 Analyzed Default class function arguments 9200 Open strtolower handle arrays in addition to strings 9211 Open URL and PHP Info/Options functions NEEDED 9212 Open fpassthru ignoring output buffering 9262 Analyzed Inconsistency in the implementation of here-docs 9266 Analyzed Unable to load 14 of php's extensions 9308 Open Allow Unix to use Win32 only mail options 9309 Analyzed update ereg function to return booleans instead of 0/1 9331 Suspended No operator overloading available 9374 Open add an optional use_include_path to file_exists() 9397 Open odbc_setoption() cannot accept string value (patch included) 9417 Open zend_eval_string() doesn't work like eval() :( 9426 Open Form variables encoding problem 9440 Open Bug in php.ini parser 9441 Open New feature for foreach control structure 9515 Open PHP misbehaves when run as a script with SERVER_NAME environment variable def'd 9516 Open No trivial way to bypass safe mode when running as a shell 9517 Open No settings for OCI8 module regarding persistent connections 9558 No Feedback array hanling 9572 Open mysql_connect() with timeout 9578 Open mysql_select_db() returning currently seected database 9622 Open Support for mime_header_encode 9654 Open is_type consolidation 9676 Open Feature request for set_time_limit 9743 Open can exec() or system() return the pid ? 9750 Open Informix Fetch Array 9751 Open WANTED: Informix RESET 9752 Open Auto Table Generation (ifx_htmltbl_result) 9765 Open syntax request 9768 Open Support for negative_equals_false configuration variable 9777 Open Function/Class prototypes? 9823 Open srand() -- seed should default to (double)microtime()*1000000 9824 Suspended lack of bidirectional popen() 9877 Open Need SYSV Message Queue Support 9900 Open sem_remove or similar missing 9902 Open Converting to/from mysql timestamp 9928 Open Feature rqst: timeout in readline 9969 Open Feature request: persistent FTP connections 9976 Open No DTD support in DOM functions 9978 Open Encoding for XML version declaration 10032 Open mysql_connect not making a new connection each time it is called 10055 Open strtotime() doesn't work on MSSQL standard dates 10102 Analyzed Parse error 10104 Open Feedback 10141 Analyzed $HTTP_USER_AGENT 'breaks' in a URL-included file 10160 Open Unix timestamp doesnt go over Tuesday 19 January 2038 05:11 10203 Analyzed foreach weakness 10217 Feedback Feature 10262 Open fgets/fputs timeout 10310 Open feature request 10344 Open in memory container for each machine user 10349 Open Warning: getrusage() is not supported 10350 Open OCIResult doesn't return time for an Oracle Date field 10351 Open Parsing problem with nested ? : structures 10352 Open Request for stri_replace 10359 Open opendir enhancement 10429 Open Improving substr() 10502 Open parsing for HTTP_POST_VARS drops duplicates 10519 Open $HTTP_COOKIE_VARS spoofing 10524 Open register_shutdown_function request 10527 Open Declare variables as constants 10546 Open extract() to work with objects 10549 Open Performance problem with Openlink ODBC drivers 10596 Suspended Suggestions for new functions 10629 Open SMTP: mail() the fifth parameter 10657 Open settype() with larger than 32bit values 10677 Open Session lifetimes beyond browse on per session basis 10700 Open unlink() doesn't like win/unc names 10743 Open class functions & PHP core functions inconsistently clash ;) 10863 Open serialize/unserialize doesn't handle references 10885 Open Add result type to mssql_fetch_array 10916 Open (Feature Request) OS-independent path parsing 10937 Open Interface to execl() library call 11004 Open Allow ini_set() of magic_quotes_sybase to have effect 11060 Open 64 bit integer support 11063 Suspended $var = function_returning_array(args)[0]; doesn't work 11067 Open dumpmem() does not ident, or even make new lines when called 11077 Open two new array functions 11100 Open session_garbage_collector function 11189 Open domxml: No external DTD-Validation 11262 Open Sybvase-ct: suppress "command aborted" messages 11282 Open dBase3 support needed (MIVA uses it) 11352 Open HTTP server internal redirect 11457 Open limit for str_replace() 11537 Open We need an operator for prepending a string to a string. Something like =. 11549 Open open_basedir/include_path security improvement 11558 Open Sybase-CT functions not found. 11567 Analyzed True Dynamic Binding and Public/Private 11592 Analyzed need for an a SIGALRM based timeout mecanism 11596 Open More ways of passing by refrence 11615 Open change/modify parent syntax 11626 Open additional oci function for quoting 11651 Open Need something like a __LINE__ constant to show the line in *main* file. 11753 Open Need way to load sent XML 11756 Analyzed Private, Protected variables in classes 11798 Open "svar_dump()" wanted 11812 Suspended mail function 11830 Open domxml_new_child should manage also xml docs 11836 Suspended Require nor Include works inner a class file 11878 Open __DATE__ /__TIME__ constants 11894 Open want posix_getgrent() function 11939 Open get HTML title 11944 Open Scripting language features 11982 Analyzed session_expires() 12012 Open dec2bin and bin2dec 12023 Open mysql_result moves the data pointer forward one row. 12028 Open array_sum changed 12066 Open Enable transparent Session IDs for a whole Domain not only relative Links 12192 Open case insensitivity for in_array 12204 Open Datbase can not spoken on. 12214 Open Additional param to ereg/eregi/ereg_replace/eregi_replace 12225 Open [XML] support for other encoding in utf8_decode , utf8_encode 12256 Open Error tracking:pass the line number of the function call instead of fun.defin 12257 Open list() can't handle associative arrays 12284 Open negative limits in explode() 12312 Open array_mt_rand() ? 12321 Open ftruncate poorly named, suggest alias 12370 Open Feature suggestion 12379 Open conversion from html entities to normal text 12385 Open getmxrr returns an invalid false message when... 12405 Open The result of create_function should be accepable to the parser 12428 Open I want 'echoln' 12442 Open optional linenumbers in show_source 12447 Open Function to encode strings for XML 12486 Open fgetcsv - Why not a getcsv (string not file) version? 12501 Open authen/authz handler capability 12512 Open E_INFO/E_USER_INFO 12513 Open Automatic Rollback of open transactions in persistent links 12526 Open additional functinality to get_html_translation_table 12530 Open Shuffle shouldn't use the least significant bit of rand() 12548 Open session_set_save_handler() with php internal session storage 12554 Open switch() bug 12564 Open PEAR::db and dbx extension 12568 Open Feature Request for function is_subclass_of 12595 Open $argv passing 12610 Open vaprintf() and other va_arg functions please! 12630 Open BUG: cannot return 12649 Open error tracing 12669 Open Utterly Global Variables - What Zeev was talkin about 12712 Open a little suggestion 12713 Open felix 12739 Open strtolower/strtoupper and special characters 12766 Feedback easter_days breaks for year before 1753 12771 Open new_object_array() 12779 Open Quote operators 12802 Open gethostbyname/gethostbyaddr timeout 12809 Suspended function calls, default arguments and passing references 12819 Open variables and constants in classnames 12833 Open Would be nice to have better transaction support 12856 Open dynamic default function parameter not possible 12857 Open get_html_translation_tabele() and non HTML_SPECIALCHARS 12866 Feedback Speaking of Payment Processing... will PHP ever have a POST() function? 12872 Open User-defined safe_mode restrictions 12895 Open mysql_fetch_row 12896 Open is_directory should point to is_dir 12897 Open include 12930 Open request for &&= and ||= operators 12944 Open new date() and getdate() feature 12969 Analyzed No output with %V 12981 Open request: bare regexp and =~ operator 12985 Open mysql_connect() forces reuse of the connection 13002 Open annotated documentation download request 13011 Open formatting numbers 13048 Open libical / iCalendar support 13161 Suspended make delete() as alias of unlink() and unset(), not as just dummy. 13162 Open php_value & php_admin_value is better to accept "" (null value) 13195 Open Support for OUT parameters from Stored Procedures in ODBC wrapper 13199 Open Punctuation of month abbreviation in date() 13216 Open Removal of redundant function call 13217 Open Removal of unneeded code from execution flow. 13261 Analyzed More restrictive File-system access 13280 Open suggestions about variables scope, warnning 13359 Open Formating php.ini 13363 Open variable variables with arrays 13364 Open domxml: Add support for ATTLIST 13429 Open Real reflection API 13462 Open Error Logging 13475 Open Patch For Sybase stored procedure return values and and output params 13512 Open The backtick operator only returns stdout, not stderr 13533 Open new function 13534 Open tab-width for highlight_* functions 13535 Open missing or not documented thing in sessions 13547 Open String position of preg_match_all 13610 Open heredoc: any chars (even white space) after closing ";" causes error 13623 Open ESMTP Functionality 13670 Open floating point number display 13725 Open --disable-assert to disable assert() completely? 13730 Open StrPos is deficient 13756 Open exponential ** operator 13804 Open File Type Register 13805 Open missing function: imap_getquotaroot() 13810 Open Per directory php.ini overrides 13825 Open sort functions 13833 Open disable_functions does not work when set from httpd.conf 13843 Open add the execv functionality to PHP 13906 Open Oracle OCI Non-Blocking mode 13907 Open Oracle Fetch row by row number 13944 Assigned in a function, I want to know the file/line that CALLED the function 13949 Open sort option for dir() 13965 Open new functions for ODBC 13966 Open insert id function for ODBC 13993 Open eval() parse errors not using error_handler 14037 Open domxml: Memory leak in xmldocfile function 14069 Open Need function for Informix 14071 Open 'admin-values' php.ini also for CGI-binary 14097 Analyzed Add option to file() to strip \n 14166 Open patch for mail() to use sendmail_from on Unix 14192 Open Disable Error Control Operator 14208 Open shm_put_var problem and new shm functions 14210 Open Can we have ZEND_HANDLE_STREAM? 14215 Open str_replace feature request 14231 Open c-function select() please 14246 Open dns operations don't allow picking resolver 14263 Open Don't free each allocation in cgimode 14285 Open Forcing variable declaration 14306 Open Need a something to pass to use default function values 14316 Open Incorrect upload_max_filesize causes problems 14369 Analyzed ftp_* functions do not respect safe mode 14387 Open DESTDIR option to make 14393 Open Function calling filename built-in access 14399 Open eregi_replace does not handle upercase scandinavian characters 14403 Open $obj->eval() 14404 Open scope notation 14405 Open strict type control ability 14406 Open typeof operator 14412 Open ucwords() new parameter 14428 Open range-based regrouping and import ability 14473 Open strtotime wont parse date 14523 Open Additional parameter for str_repeat 14561 Open strtotime() bug 14562 Assigned dBase: Unable to obtain dBase file structure 14564 Open Trusted Connections Not Supported 14613 Open Implement Function/Feature Conformity Tests 14615 Open PHP log does not contain proper CRLF's 14640 Open Support "{@$foo}" and "{@$foo['bar']}" syntax 14643 Open wordwrap() only for long words 14694 Open GNU fmt-like linebreak algorithm as PHP function 14704 Open phpversion (bool Float) request 14705 Open func_get_args(): return references to params? 14712 Open allways global scope 14715 Open suggestion:mapping session file into dirs 14736 Open about error_reporting for $_GET 14794 Open xml_set_object() should take object by-reference 14845 Open var_dump sometimes crashes after array stringitem is overwriten with arrayitem. 14853 Open escapeshellarg should return '' for empty argument list 14896 Open Multi threaded support 14901 Open Add a new language construct which prints to stderr by default 14918 Open Need function to explicitly set a hash's internal pointer to a certain key pos 14920 Open Internal pointer stack for arrays, to solve pointer problems 14924 Assigned The POSIX access(2) function is not available 14949 Open fprintf function 14976 Open gzopen URLs like fopen() does 14980 Open "Illegal or malformed form data." is a terse message 14994 Analyzed Adding TIFF support to GetImageSize 15013 Open String length restriction in mssql functions 15018 Open readdir() not affected by safe_mode 15036 Open PHP should be able to control module load order. 15078 Open --trans-sid doesn't work with Header("Location: ...."); like redirects 15095 Open use of references in arguments with defaults 15098 Open func_get_args_by_ref() 15101 Open eval() in other context 15128 Open php_java array access 15133 Open SSI 15135 Open improving eval() with context 15145 Analyzed xmlSubstituteEntitiesDefault(1) to domxml_xslt_process 15171 Assigned popen not fully supported 15184 Open Calculate the quarter with date('Q')? 15208 Open .phps file additional feature 15211 Open println? 15216 Open Number of weeks or parts thereof in a month 15232 Open Need a possibility to compare two references 15233 Open Possibility to make include() from within functions with global scope 15242 Analyzed PHP functions as extensions for libxslt 15283 Open secure ftp support 15336 Open New mysql function: mysql_real_connect 15347 Open strtok multiple string handling 15367 Open open_basedir = "~" (cgi mode) 15376 Open Can't exit an include file from function 15399 Open returning fields with appropriate type from MySQL 15459 Open milter interface 15465 Open magic_qoutes_gpc without control of php.ini 15494 Open Need checkdnsrr() functionality on Windows 15498 Open identical checkbox names in HTML form 15523 Open Line Number 15599 Open functions returning references, oddity(?) 15606 Open Parent instance by reference in objects 15663 Assigned add foreach reference values 15677 Open quoted array index in string should be possible 15689 Open more variable type should be added 15707 Open suggestion to Document about time() and other "Date and Time functions" 15725 Assigned SSL support in FTP 15734 Open get_defined_constants() feature 15764 No Feedback mysql_real_connect client flags: compression & SSL 15791 Analyzed set_error_handler() can not be used to set error control to a class function 15810 Open superglobals does not work with dynamic vars in functions 15857 Open Object Overload __set __get allow set by reference 15872 Open php_admin_value disable_functions does not work when set in httpd.conf 15881 Open a new format char for sprintf kind function 15920 Open range() with a step parameter 15938 Open DOMXML: Implement nodeName 15941 Open feature request for str_replace_first 15972 Open strip_tags allows javascript 15987 Analyzed Mac OS X support (target: HEAD) 16079 Open Allow '.' (concat) operator on static strings 16118 Open Request for new feature: textlen() or textlength() 16119 Open Swapping two elements of an array 16143 Open MSSQL 2000 support 16162 Open Custom FTP-Commands 16195 Open GET/POST-vars does not work according to standards 16303 Open file() MUCH faster than fsockopen() + fgets() but we should be able to set th 16330 Open There is no E_NONE constant. Patch included. 16349 Suspended no way to tell if a session exists without starting it 16367 Open No way to get O_EXCL 16384 Open Default value of a mysql table field 16410 Open array function request 16422 Feedback utf8_encode/utf8_decode requires the XML extension 16437 Open Reference to function namespace variables 16455 Assigned "Progress Indicator" of some sort in ftp get 16456 Open "resume" of ftp downloads 16464 Open func_get_arg(), func_get_args() should be reference proof 16480 Open strings should remember whether they are magic_quoted, htmlized or neither 16487 Open error_reporting change 16495 Open Can mysql_select_db return the previously selected db? 16539 Open Cannot determine error status 16550 Open snaps.php.net win32 snaps not available 16554 Open Flags to mysql_connect 16588 Open Extra EXIF headers ===============================================[Filesystem function related]== 8785 No Feedback getlastmod returns 0 when run in NES in CGI mode 9203 Open flock doesn't work properly on Windows 2000 10566 Analyzed don't work properly fopen 11322 Open Security hole in multiuser environment 11563 Open FileFunction macro in filestat.c appears to be missing a check (fix included) 11984 Open filetype function not working for non-existant files 12097 Open fseek bug 12556 Open fgetcsv ignores length if quotes not closed 12643 Analyzed fgetcsv does some wrong things 13500 Open copy() gives incorrect open_basedir() errors 13626 Open fwrite writes more data to file than in output string 13919 Open flock not working 14003 Open fgetc from php://stdin doesn't return after one byte typed 14182 Open pclose() returns -1 if configured with --enable-sigchild, see #8992 14624 Open is_link() fail with error if the link is not found 14923 Open is_readable, is_writable, is_executable fail on POSIX ACL based filesystems 15054 Open copy has wrong permissions 15089 Analyzed stat() produces warning instead of error-code. 15117 Open fopen and fwrite writes to much data in mode a and a+ 15200 No Feedback file() function sometimes adds slashes before single and double quotes 15218 Open file_exists ('') returns TRUE 15547 Open tempnam() bypasses security 15550 Open Fgets don´t get a file line correctly 15594 Open fwrite doesn't prompt error when no disk space 15692 Open ISAPI fputs \n = \r\n 15801 Open unjustified open_basedir restriction on copy() 16048 Open fgets/feof failure when stdin is reading from a pipe 16170 Open Apache error fread() fopen() 16356 Open file() on URL may leave open socket 16364 Open Overflow with fgetcsv() 16393 Feedback @ does not mask E-WARNING produced by unlink 16409 Open include_once includes multiple times 16426 Analyzed $HTTP_POST_FILES['userfile']['tmp_name'] returns "n" 16432 Feedback fwrite fails on long text string 16510 Open fopen to a URL containing spaces fails 16521 Open file() - incorrect behavior (line endings ignored) on files with Mac EOLN (CR) ===============================================[FTP related]================== 12344 Open Handling of multiples responses in ftp client is buggy 12436 Open ftp_fput causes memory access violation 13214 Open Request: Tiny patch to allow fast recurisive ftp_rawlist 13400 Open ftp functions are sometimes REALLY slow 13868 Open Unable to find ftpbuf 1 in .... 13913 Open Empty strings on "nlist" and "rawlist" 14052 Open ftp_rawlist: Hangs up 14247 Open Can't list directories in symlink using ftp_nlist and ftp_rawlist 14748 Feedback ftp_put problems 14861 Open nlist and rawlist don`t work with ftp-daemon of Suse 15231 Open ftp_rawlist doesn't work when spaces in directory pointed to 15296 Open ftp_getresp()'s bug when ftp server returns multiple response code 15383 Open ftp_connect() unable to connect to Internet IPs 16058 Open ftp_get() try to create temp file in the c:\ ===============================================[GD related]=================== 10548 Open function ImageTTFText always get wrong chinese words from TTF ... 12618 Open unable to select colors using palette of (loaded ) pngs or gifs 12619 Open ImageCreateFromPNG does not set transparent color 12780 Open ImageCopyResampled ignores srcX and srcY parameters 13281 Open GD 1.3 can't be integrated 13502 Open ImageTTFText double-strikes text 13527 Open Problem displaying some fonts 13650 Open ImageWBMP does not make correct output. 14350 Open gd cant handle some png files 14735 Open Missing function call in imagepsextendfont prevents multiple invocations 14820 Open Feature Request: ImageColorLeastUsed 14870 Open GD breaks SIGUSR1 and SIGHUP 14876 Open ImageTTFText produces strange Warning 14974 Open Transparency with ImageCopy 15094 No Feedback GD2 bugs 15212 Open Freetype Linkage in 4.1.1 / absolute paths in TTF-functions 15252 Open ImageCreateJPEG() crashes server 15303 Open Error compiling 15656 Open text is rendered too large 15913 Open imagettftext will not work 15925 Critical ext/gd/config.m4 broken in HEAD 16002 Feedback imagecreatetruecolor not recognizing create version of GD library 16097 Feedback Imagejpeg/imagecreatefromjpeg fail to recognise resolution over 72 dpi 16275 Open ImageCreateFromJPegCtx Undefined Symbol 16300 Feedback PNG generation w/ TTF Font loading works from cmd line but fails from http 16529 Open JPEG library reports unrecoverable error ===============================================[Gettext related]============== 10058 No Feedback Gettext doesn't react when I change the language 10135 No Feedback Problem(?) with environment variables when running as module 10333 No Feedback anything is OK, it really seems a buggy thing 10603 No Feedback Problems changing the language. ===============================================[HTTP related]================= 10307 Open PHP refusing to get temporary file name from an HTTP PUT request. 10383 Open Receiving an HTTP PUT, rather than sending one 10998 Feedback include http file 11112 Open socket_set_blocking breaks in w32, you can send data but cannot read response 11578 No Feedback http header order not respected and messages not transmitted 13116 No Feedback setcookie would not work when expire is set 14255 No Feedback setcookie bug (Cookie is destroyed/Inaccessible) 14298 Analyzed PUT absent $PHP_PUT_FILENAME $PHP_UPLOADED_FILE_NAME 14733 No Feedback header() not working 15235 Open file("http://[...]") never times out 16337 Open include() does not decode % correctly 16342 Open can not set cookie with domain specified 16346 Open MSIE Cookies problem 16353 Open can upload other files but not zip or visio files 16458 Analyzed header() does not replace headers but always produces duplicates ===============================================[Hyperwave related]============ 10353 Open Intermittent segfault on failed connection 10913 Open hw_who() returns incorrect data & prints extraneous string (patch incl.) 10944 Open hw_info() prints garbage for server string 11125 Open hw_insertanchors() segfaults with non-hex Position attributes 11246 Open hw_incollections() misbehaving ===============================================[ICONV related]================ 15799 Analyzed Another segfault on iconv 16069 Analyzed ICONV transliteration failure ===============================================[IIS related]================== 8649 No Feedback session.auto_start can't write to files in isapi mode 8744 Feedback call to header() causes CGI error 9206 No Feedback unable to load file to the disk 9428 No Feedback CGI error when executing php script in a virtual directory 9579 No Feedback POST method not performing action handler (ISAPI) 9688 No Feedback FTP_PUT / FOPEN 9852 Open Header redirect and db connection cause "CGI misbehaved" 9981 No Feedback http 500 Internal Server Error 10486 Open IIS causes the Internal server error 10839 Open Crashes (critical on W2k) 10883 Open conflict between PHP ISAPI and asp.dll 10930 Open Can't connect to mysql after running some code that crashes IIS 5 11002 Open Corrupt Output 11300 Open MSCOMCTL.OCX is missing on clean Windows machine. 11661 Open Memory Access Violation 11783 Open CGI Error with non local Virtual directory 11788 Open CGI-Error and 502 Bad Gateway 12184 Open PHP has encountered an Access Violation at 0129E68A 12215 Open 500 on all server-side script 12264 Open PATH_INFO and PATH_TRANSLATED not being correctly set 12309 Open Bad downloads - PHP 4.0.x ISAPI 12366 Open PHP-ISAPI Module hang 12406 Open Can't connect to MySQL through IIS 12410 Open PHP MySQL commands don't work with MS Proxy Client 12421 Open The w3swc service is gaving error cannot load isapidll 12461 Open browser hangs unless I uncheck keep alives in IIS5.0 12538 Open keep-alives and IIS5.0 and Php4.05/php4.06 12540 Open setcookie doesn't work! 12562 Open CGI Error-CGI application misbehaved 12585 Open W3C service stops 12588 Open PHP engine hangs 12700 Open 502 Gateway Error/Failed to Return Headers 12746 Open CGI Bad Header Error - Random 12807 Open Checking for a file with file_exist crashed PHP 12820 Open php isapi crashes 12893 Open Cgi error with Virtual directory 12975 Open Unable to load dynamic library 'd:\applications\php\extensions\php_oci8.dll' - 13098 Open Problems to bring up IIS after shutting it down through a command prompt. 13167 Open Access Violation, odbc when I use distinct 13207 Open open_basedir not restricting file access properly 13237 Open Installing PHP4 with Proxy/IIS server causes Proxy to fail. 13240 Open Getting cgi timeout error 13324 Open Access violations / memory problems 13345 Open PHP hangs 13370 Open Error startup php4isapi module 13371 Open PHP Crashes with weird output sometimes 13408 Open Follow on to bug 7237: PHP ISAPI module leaks memory, crashes IIS 13539 Open ASP and PHP crashed, no restart possible 13689 No Feedback machine crushes 13963 No Feedback Uploading files fails in IIS 14380 Open AccessViolation: oci-Problem 14389 Open cookies problem 14471 No Feedback Problems with "php_iisfunc.dll" extension ( module ) 14598 Open Exception Error using ISAPI Version 14818 Open Error 405 and Can Not Find Server when executing any php script 14878 Open php.exe crashes when accessed remotly but works fine at localhost 14882 Open PHP as ISAPI dll causes ASP to generate Internal Server Error 5000 14886 Open Access Violation in error handler with PEAR DB (ISAPI) 14971 Open unhandled exception processing the ISAPI 15317 Open setcookie() does not work with CGI PHP 15333 Critical strndup access violation 15722 Open ISAPI version of PHP4 running in IIS 6 causes occasional event ID 1013 16173 Open https & headers (Content-type) not working 16200 Open Intermittant error [270 (0x0000010e) ] accessing ASP and HTML pages on Virtual 16222 Open stripslashes not stripped 16313 Open Error in CGI Application 16325 Open Memory leak causes DLLHOST to become large 16542 Feedback safe_mode_exec_dir and exec() ===============================================[IMAP related]================= 7848 Open IMAP is very slow in CGI version 10356 No Feedback imap_utf7_encode cann't encode Chinese correctly 11153 No Feedback imap_check() returns wrong date 11561 Open Inconsistent behavior between imap_getmailboxes and imap_getsubscribed 11603 Analyzed imap_sort function fails on huge mailboxes 11871 Open imap_search fails to search using FROM 12346 Open 4.0.6 imap refuses to authenticate to VMS IMAP4rev1 Server PMDF V6.0-24.1 12555 Open imap_body on empty messages causes seg fault 12667 Open Memory Hole Problems 13097 Open strange linebreaks in decoded base64 string 13156 Open php segfaults on imap_sort 13179 Open Cannot open two concurrent IMAP connections? 13373 Open imap_fetchstructure() does not return $struct->type for text types 13499 Open imap_open fails to authenticate 13837 Open imap_open fails 14268 Open HEADER keyword does not work in imap_search() 14410 Open imap_fetch_overview: is missing in_reply_to 14673 Open quota ressources 14931 Open Apache hangs when using imap with SSL 15197 Open imap_reopen() returns TRUE instead FALSE called with nonexistant mailbox 15238 Open imap_search() does not support search criteria SENTSINCE 15304 No Feedback if imap and sybase are compiled in mssql_connect does not find host 15443 Open imap_sort should use TOP to fetch mail headers from POP3 accounts!!!! 15546 Open Warning: Invalid mailbox list: "Mr (errflg=3) in Unknown on line 0 15595 Feedback imap routines hang when "To" header is too large 15630 Open imap_utf7_decode appears to be broken 15740 No Feedback It is better to replace imap_getquota() with imap_getquotaroot() in php_imap.c. 15809 Feedback IMAP undefined symbol: ssl_onceonlyinit 16004 Open @imap_msgno() and @imap_header() display warnings 16413 Open Apache Startup Failure: Undefined symbol "_mail_string" ===============================================[Informix related]============= 13459 Analyzed ifx_connect: E [SQLSTATE=IX 000 SQLCODE=-439] 13655 Open undefined symbol: stat 13742 Open Does PHP work with Informix Online 5.0? 14254 Open SQLERROR -439 14314 Open Additional Comments on #14254 14547 Open Informix as shared module libtool rpath problem 14665 Open ifx_fetch_row returns string non-zero terminated for selected LVARCHAR fields 15342 Open Informix ifx_num_rows 15600 Open ifx_fetch_row return the same tuple more than once 15628 Open Multiple Connections not allowed 15688 Open undefined symbol:stat 16145 Open Informix Error -439 16518 Open undefined symbol: stat ===============================================[InterBase related]============ 6976 Assigned ibase_query can't execute SQL statements that can't be prepared 7014 Assigned ibase_query (rest of php_interbase.dll?) 8142 No Feedback on exit() from method, interbase makes a mess with transaction ids 8517 No Feedback BLOB functions don't work with IB6 8604 Open ibase_blob_import() return pure binary string, unusable in INSERT INTO sql 8713 Open Compatible with InterBase ver.<6.0 8797 Open There is no way to use REC_VERSION transaction parameter 9990 Open php forces the apache to wait for ever 10326 Open Error while inserting cyrillic symbols into database 10610 Open Read Only behaviour! 10816 Open Crash when calling ibase_trans with invalid link ID 10872 Open Cannot load php_Interbase.dll extension... 10948 Open Apache can't load with php_interbase.dll 11154 Open Invalid Result on IB Decimal/Float datatype called from stored procedure 11176 Open Bad results when retrieving IB decimal/float data type from stored procedures 11208 Open ibase_blob_open crash apache 1.3.19/20 11468 Open Cannot execute stored procedures 11530 Open PATCH: InterBase/Firebird Decimal/Numeric type returns incorrect value type 11631 Open php_interbase.dll problem 11644 Open Interbase dll causes PWS ISAPI to die 11924 Open problem with ibase_execute called through call_user_func_array() 11953 Open wrong conversion from data type NUMERIC with decimal places into string 12003 Open failed to locate host machine 12038 problem with closing database handles 12052 Open BUG #12006 12330 Open ibase_query not support class 12338 Open Cannot open two connection simultaneously 12549 Open Connect Interbase Server 13020 Open Error when reading data from Interbase 6 database 13383 Open The specified CGI application misbehaved by not returning a complete set of HTT 13573 Open persistant connections sometimes hand 13807 Open Incorrect display of NUMERIC(15,2) data 14011 Open Segmentation fault on connect to Interbase 14039 Open Invalid statement handle 14328 Open Interbase and error handling 14573 Open function "ibase_trans etc." of InterBase ext. module is wrong. 15151 Feedback Decimals/Numerics stored as int64 always display as xxx.2 15314 Open php can't handle values of type double correcty 15316 Open Segmentation fault on Interbase blob creation 16016 Open Unable to load dynamic library ===============================================[iPlanet related]============== 9114 Open X509 Certificate Environment variables 9116 Open PHP will stop returing anything in NES 4.1 SP1 9169 Open Default html file is not showing anymore 9851 Open getenv() functions do not return variables. 10379 Open ns-httpd crashes on php content. 10581 Open signal 6 when starting server 10817 Open Web server won't start after configuration 10821 Open Web server won't start after php make install 10871 Open pclose() failed. (2: unknown early startup error) 11039 Open Netscape Server 3.6 / Solaris 8 problems... 11174 Open Web server won't start after php make install 11181 Open PHP_AUTH_USER and PHP_AUTH_PW are not set 11256 Open OleMainThreadWndName not responding 11442 Open Random "Warnig: Failed opening" on any php file 11713 Open IPlanet and sessions cause script to terminate prematurely 12258 Open ns-http won't start: Dies in thread-init code 12431 Open IPLANET JVM abort 12466 Open iPlanet aborts in call to ts_resource in php4_init 12573 Open URGENT: Can't start Netscape Enterprise 3.6 web server 13042 Open Web server aborts during startup 13063 Open pclose() failed. (2: unknown early startup error) 13174 Open SIGABRT when starting iPlanet 13223 Open php4.0.6 on solaris 5.8 for iPlanet4.1 SP5 won't start 13438 Open missing environment under iplanet like $PHP_AUTH_USER 13739 Open NS Enterprise 4.1 aborts on NSAPI module load 13962 Open Problem with Environment Variables 13971 Open OleMainThreadWndName end task windows appears while logout 14141 Open Fatal error: fatal flex scanner internal error--end of buffer missed in ... 14415 Open Unknown Startup Error 14634 Open php causes iplanet to crash 14885 Open PHP Variables is not supportted 15439 Open PHP hangs web server when started 15778 Open Segmentation Fault with iPlanet module on php4_init 16418 Open Configures and makes but web server will not start 16524 Open PHP script crashes iPlanet ===============================================[Java related]================= 8459 No Feedback PHP's crash JVM after a few requests 9162 No Feedback Java support corrupts Hashtables 9507 Suspended Java objects as session variable 9608 No Feedback JVM instantly crashes with ext/java 9658 No Feedback saps Servlet reproducible crash. 9659 No Feedback sapi servlet crashes when exceptions thrown in java code 9660 No Feedback sapi servlet excessive memory usage. 10146 No Feedback PHP Servlet is not thread-safe 10271 No Feedback PHP servlet causes segmentation violation in native code 11925 No Feedback Php under with sapi servlet crashes 11927 No Feedback php sapi servlet doesn't compile 12579 No Feedback Java support does not work 12781 No Feedback Java loader 13088 No Feedback Java call creates Segmentation Fault in Apache. 13275 No Feedback returned objects cause a core dump in zend 13301 No Feedback no new process when using JVM 13344 Open sablot bites ext/java (sun jdk 1.3.1) 13996 No Feedback Java crashing HTTP session 14153 No Feedback Servlet sapi native code problems 14441 No Feedback php/sapi crashes under linux 14754 Open java.* configuration values from php.ini lost on subsequent executions 14773 Open Output contains always 14868 Open incorrect configuration for --with-java 14908 No Feedback Unable to create Java Virtual Machine 15113 No Feedback PHP4,javabeans, libphp_java.so 15223 Open PHP Memory violation using Java 1.3 15679 Open "Unexpected Exception" thrown from php sapi/servlet 15702 Open Segmentation fault (using jdk1.4 with php 4.1.1) & libphp_java.so not created ===============================================[LDAP related]================= 11845 Open ldap_mod_add/ldap_mod_del duplicating LDAP calls sporadically 12223 Analyzed ldap rebind procedure implementation 12496 No Feedback ldap_modify always returns "Insufficient Access" 12830 Open undefined symbol: sasl_set_alloc 14355 Open ldap_connect works intermittantly 15191 Open Segmentation fault when starting apache httpd 15389 Open slow ldap connect 15431 Open Resource destructor called too early 16005 Open Conflict between OpenLDAP and Oracle 16106 Feedback LDAP + IMAP = PROBLEM 16271 Open Attribute "networkAddress" is not complete ===============================================[Mail related]================= 6537 Assigned mail() does not seem to handle SMTP multi-line responses 7068 Assigned fails when 'to:' argument has the form "Name <name@somewhere.xxx>" 9965 Open email command gives 'Warning: Failed to Receive ' 10136 Assigned Function mail() does not work properly 10182 Assigned problem with the "To" field 10769 Open sendmail_port does not work 11165 Assigned limit in lenght of mail 11247 Assigned mail() on Win32 messes with Reply-To: or Errors-To: fields, 11348 Assigned cannot send email attachments 11349 Assigned Function not working as documented 11616 Assigned Cc: & Bcc: not being picked up from header 11797 Assigned CC and BCC don't work in mail() function 11950 No Feedback not sending e-mail at all 12024 Open mail() is not supported in this PHP build 12134 Open imap problems under php406 12142 Open mail problem with apache aliases on win2000 and Linux (tested on both) 12335 Open mail() function returns false but the email was sent. 13044 Feedback unexpected characters in mail 13634 Open Warning: Failed to Receive in \nphp\nfunc.php on lines 527 13862 Open Mail() and mb_send_mail() not work on php 13908 Open address parameter truncated at char 1970 14032 No Feedback Mail() always returns false but mail is sent 14407 Open Win32 SendMail function doesn't use "From:" in SMTP MAIL FROM command 14510 Open Unknown error in mail function 14535 Open Mail function always returns false 14855 Open Access Violation when using "Cc:" in mail() 14900 Open Mail Function not working 14944 Open Access Violation with Cc header 14954 Open Warning: Server Error with mail() function 15221 No Feedback Mail function does not work 15363 Open When the 'message' size is over 3991 bits, mail function fail. 15373 Open mail() not working, no error with invalid SMTP or email address 15505 Open mail() crashes 15509 Open fifth argument in mail only supports one parameter and no spaces 15718 Open mail() is not supported in this PHP build 15755 Open Can't send MAIL 16025 Feedback segmentation fault on mail() function 16101 Open gmt exchange for mail function 16333 Feedback mail() is not supported in this PHP build ===============================================[Math related]================= 12435 Open Incorrect results from logical AND 14630 Open integers wrapping around rather than being promoted into floats on overflow 15565 Feedback AND operation errors on datas from MySQL Table 15946 Feedback Math output errors ===============================================[mcrypt related]=============== 15140 Assigned mcrypt fails for twofish but work properly for all other type of encryption 15830 Open configure recognize lib mcrypt 2.4 as 2.2 ===============================================[mhash related]================ 12792 No Feedback mhash seg fault ===============================================[Ming related]================= 14995 Open "new SWFBitmap()" produces Access Violation Error 15982 Open PHP Freeze with swffont() call ===============================================[mnoGoSearch related]========== 14746 Analyzed Problem whith option --with-mnogosearch ===============================================[MSSQL related]================ 8627 Open mssql_query and stored procedures 9667 Open Can't get result of a stored procedure 9757 Open Php.exe Process doesnt kill itself 9791 Open Stored Procedures 10011 Open Get results from a store procedure 10755 Open PHP work very slow with Ms Sql, 99% processor load when I process SQL instr. 11621 Open PHP crashes while using MSSQL functions 11735 Open mssql_pconnect fails 11923 Open when you access char(2000),i only get 255 bytes data, why ? 12095 Open mssql_pconnect access violations 12250 Open Segfault when using FreeTDS connect 12348 Open Call to undefined function: mssql_next_result() 12506 Open fields of type "image" 12508 Open can't return a ntext type field in a select statement 12637 Open Error "Document contains no data" 12655 Open date-format problem 12865 Open Acentuation big problem 13008 Open Multiple update/inserts fail 13368 No Feedback 2nd call to @mssql_query does not fill $php_errormsg s'd be'permission denied' 13549 Open Broken NULL column result condition 13738 Open cant connect to external db with dns name 14357 Open segfault when using mssql_close() 14487 Open Problem with stressed charachter (like É or Ó 14730 No Feedback return wrong charset 14948 Open mssql_pconnect opens connection everytime is called 15170 Open datetime fields returns " :" string instead of field's value 15192 Open MSSQL functions crashing PHP 15265 Open printing of mssql 'bit' value crashes script 15325 Open mssql_query returns early 15371 Open corrupted/erroneous data output 15422 Open mssql_connect fails with username "\" 15632 Open MSSQL querys cause major problems 15765 Open mssql_query (and mssql_select_db) crashes php.exe 15890 Open MSSQL 2000 with php_mssql.dll - will not function 16277 Open Multiple statement in a query cause subsequent queries to fail 16403 Open datetime field error 16411 Open CGI application misbehaved by not returning a complete set of 16496 Open Stored Procedure Parameters is_null issue 16509 Open mssql_fetch_array limit on fieldname-length ===============================================[MySQL related]================ 7244 Open Problem with LOAD DATA LOCAL INFILE 11652 Assigned mysql_data_seek() and mysql_unbuffered_query() warning text 11993 Assigned mysql_close closes incorrect db handler 12451 Feedback compilation halts on libmysql extension 13589 Assigned Persistent connections stay open and accumulate 14419 Assigned Please use Character-enable mysql_escape 14465 Open make: Fatal error: Command failed for target `dbug.lo' 14768 No Feedback Upgrade to 4.1.0 breaks database connection 14801 Open my_getwd.c fails to compile with error "No way to get current directory" 14860 Open PHP segfault in mysql driver 15534 Open Undefined symbol "_mysql_init" w/php4.1.1 & not w/4.0.6 (same parameters) 15839 No Feedback random error related to stripslashes 15899 Feedback RC from INSERT INTO if incorrect 15933 Feedback PHP 4.* binary does not connect to mysql from a cron job 15956 Open Difficult to say in brief. I have included some output from gdb 15990 Open Communication error between php ISAPI module and MySQL 15991 Feedback Undefined symbol "mysql_drop_db" 16116 Feedback MYSQL_UNIX_ADDR 16272 Open SegFault in MySQL 16285 Critical mysql connection uses bogus hostname 16320 Open Array Problem 16399 Open mysql_field_flags returns "enum" for a mysql "set" column type 16526 Open MySQL pconnect behaviour changed ===============================================[Network related]============== 7058 Feedback checkdnsrr bug 12570 Analyzed feof () - no break on eof of socket 12813 No Feedback Bug id #11058 but on linux. 16302 Open socket_set_timeout closes connection ===============================================[OCI8 related]================= 6585 Analyzed OCILogOff 7306 No Feedback segfault when binding undefined php variable with a BLOB hostvar 7847 No Feedback OCI8 support with Oracle 8.1.5 doesn't work 8482 No Feedback undefined symbol: slpmprodstab 10206 No Feedback PHP in CGI mode fails to perform OCILogon 10275 Feedback can´t connect to oracle with NLS_LANG="BRAZILIAN PORTUGUESE_BRAZIL.WE8ISO8859P1 10455 Feedback The method fetchRow can't return NULL when no more data. 12260 Feedback Compile failure --with-oci8 and Oracle 8.0.4 12336 Open Unable to load dynamic library liboci8.so 13151 Open /usr/lib/dld.sl: Can't shl_load() a library containing Thread Local Storage 14151 No Feedback Installed/Compiled Php4.0.6 with Oracle9i on Linux Red Hat7.2 14278 Feedback % and / bug with INTEGERs! 14702 Feedback segfault in OCIFetchStatement with 1 or 2 chars CLOB 14802 Open --with-oci8 doesnt grok 64-bit Oracle 9i 15499 Feedback Apache crashes with Segmentation fault 15577 Feedback "failed to rollback outstanding transactions!" Oracle connection error ===============================================[ODBC related]================= 6901 Analyzed odbc_columns 8227 No Feedback odbc_field_name don't get tab1.field tab2.field back 9662 Open odbc_connect() acts like odbc_pconnect() 10114 Open Error reading LONG fields (ntext) in MSSQL (SQL Server) (bug #5237) 10302 No Feedback odbc_tables() 10469 Open ODBC_result() fails on DB2 LONG VARCHAR columns 10843 Open Function creates new array but does not reset pointer 11451 Open ODBC under Apache: DLL Initialization Failed 11763 Open odbc_exec() throws ISE 500 error 11895 Open total crash of PHP 11974 Open Pb with odbc_columns(); the 12th result(description)has a incorrect format 12263 Open odbc_tables(), odbc_results() 12339 No Feedback Seg Fault in PHP under 2k /w ODBC and Globals (apparently)... 12371 Open SQLColumns Error when using odbc_columns on Oracle DB 12492 Open odbc_result fails accessing memo fields by number 12546 Open fetching 'ntext' data type causes emalloc-bug 12702 No Feedback odbc_connect() and odbc_pconnect() fail 12962 Open odbc field name too long 13133 Open Get longbinary data from ACCESS 13152 Open odbc_fetch_row uses update cursor on ODBC cursor library 13154 Open ODBC query to Openingres 2.0 fail with scs_p_GetTblAttribs: DRV_DDTables failed 13286 Open Freetds + iODBC problems retrivind numeric fields 13445 Open odbc_execute gives "SQL data type out of range" error for store procedure 13604 Open odbc_primarykeys with Access 13654 Open Truncated "text" content returned by next_record( ) 13783 Analyzed odbc_fetch_into different issue 13809 Open Openlink 3.2 and 4.0 odbc_do and single quotes 13817 Open odbc_exec doesn't allow stored procedures to return results 13838 Open Default ODBC statement concurrency option does not allow some queries on MSSQL 13931 Open unexpected SQL error using SQL_CUR_USE_ODBC in odbc_pconnect() 14040 Open Exit after an odbc_exec caused crashes. 14216 Open odbc_tables() does not close automatically ODBC MSAccess connection 14238 Open odbc_fetch_into using an array in an object 14262 Assigned AccessViolation: oci-Problem 14436 Open odbc_fetch_row crashes PHP with aliased table 14851 Open problems w/ db2 char() for bit data 15141 No Feedback ODBC Error Messages 15195 No Feedback SQL error: [Microsoft][ODBC dBase Driver] Could not delete from specified table 15281 Open OleMainThreadWndName: php.exe application error 15306 Open odbc_fetch_row does not always return all rows 15331 Open odbc_fetch_array gives a "Call to undefined function" 15619 Open odbc_result() doesn't return ms sql server text field correctly 15758 Open PHP odbc_connect() doesn't work on IIS 5.0 15880 Open select (name) from ..... doesnt work! 15897 Open pretty random replies while using odbc functions 15898 Open obdc_close is not closing sockets 15900 Open arguments to functions or again ODBC bug. 16006 Feedback ODBC data transfer 16132 Open odbc connection closed twice 16286 Open undefined symbol: SQLParamData 16401 Open odbc_num_rows() returns last number of rows, no matter what result id is given 16404 Open Missing rows in select ===============================================[OpenSSL related]============== 11885 Suspended Link problems with OpenSSL 0.9.6a 13522 Feedback openssl_seal always returns FALSE 13981 Open unresolved symbol loading shared libphp4.sl 15224 No Feedback openSSL and cURL results in Apache seg-faulting ===============================================[Oracle related]=============== 9463 Open cmd line PHP crash with oracle+oci loaded 9630 Open Ora_Logoff doesn't return true or false. 9796 Open RAW datatype not handled in Ora_GetColumn 9917 No Feedback left open Oracle cursors break mail() function 10416 Open Fetch_cursor return second record not first. 11486 Open Oracle connection resource disappears in nested connections 11550 Open Cannot return a NULL as out parameter of a stored procedure 11872 Open defunct Problems with oracle 12467 Open Undefined entry point in php4ts.dll 12967 Open Problem with Oracle and LONG Datatype 13621 Open ODBC connection to Oracle doesn't work. 14753 Open a bug about Ora_pLogon ===============================================[Other web server]============= 5653 No Feedback PIKE specific: with setcookie(), only the last cookie is written 10804 Open No HTTP_POST_VARS 10931 Open IBM HTTP Server 1.3.12.2 can't load the php4apache.dll 12100 Open php with cern httpd as cgi can't execute in ie 12529 Open Redirection fails in ISAPI mode 14209 Open tux sapi doesn't work when using virtual hosts 15583 Open thttpd patching fails 15885 Open thttpd can't serve 0 byte files with PHP patches 15912 Open thttpd: Trailing \r\n in last varible when doing POST request with IE 16061 Open Post Problem with thttpd ===============================================[Output Control]=============== 12227 Assigned Over writing output buffer and returning it causes segfault 15209 Critical Under Apache, register_shutdown_function() broke between 4.0.x to 4.1.x 15245 Assigned HTML output is corrupted unless implicit_flush turned on 15493 Feedback PHP sends no location header when output_buffering = On 15612 Analyzed Constant Refresh when files too large. 15613 Open readfile doesn't work correctly with WIndows XP 15625 Open Output stops 15646 Analyzed the flush() does not flush the output buffer 15851 Open Output has extra garbage past end of output 16000 Open fpassthru and timeouts 16077 Open Large output data causes output buffering to crash 16081 Feedback doesn't seem to honor fopen stdin position in code 16099 Feedback Include_path predefined ===============================================[PCRE related]================= 12668 Analyzed unexpected behavior of preg_replace 16040 Feedback nested preg_replace_callback()'s won't work ===============================================[PDF related]================== 12576 No Feedback php_pdf.dll is expired ===============================================[PEAR related]================= 6893 Analyzed feature request - makelinks() function 15590 Open PEAR's send() & special characters 16017 Open rule_pear.mk continues cleanly even on failure ===============================================[Performance problem]========== 9407 Suspended Memory Problem while using self referencing objects... 10299 Analyzed CPU and Memory Spike 13234 Open memory leak (see also bug 12507) 13649 Analyzed IBM DB2 memory leak 14237 Open reference calls in some cases very slow 14937 No Feedback Script timeouts at random places 14982 Open passthru() fails if more than one command line argument is quoted 15082 Open too slow 15180 Open _POST --> HTTP_POST_VARS (refrences!!! not) 15482 Open Memory Leak 15485 Open memory ressource with socket_read() 15746 Open Process exec() is slow from webserver - running from shell is ok ... 15833 Open PHP 4.1.x results in huge memory usage during runtime under Solaris 8 15868 Open infinitive loop hanged apache 15876 Open odd slowdown in calling small sections of php code 15965 Open memory limit not honoured 16129 Open phpinfo() makes apache segfault 16133 Open PHP-GTK unset does not free memory for a widget 16545 Open parse_url is *slow* ===============================================[PHP options/info functions]=== 7365 No Feedback php_value error_reporting doesn't work for me 13771 No Feedback did everything from DSO installation to static 14508 Open Strange default of safe_mode_exec_dir 14786 Open configure failure without trailing slash 14843 Open Magic Quotes GPC is broken in 4.1.0 14856 No Feedback Error compiling apache after compiling php with custom-odbc 15006 Open parse_ini_file barfs when seeing ~ (hex 7E) 15019 Open browser.ini 15088 Open Problem with disable_functions on Apache 1.3.20 and PHP 4.1.1 15144 Open Master includes being over ridden by a local include that does not exist.. 15374 Open include_path loses value when executed 15382 Open Printer.dll is not included in php 4.1.1 15768 Open FastCgi not picking up envrionemnt variables 15919 Assigned variables_order not works well 15969 Open Observation on deprecation of register_globals 15975 Open Parse error for lates version of browscap.ini 16041 Open CGI and EXECUTABLE version produce different results for environment variables 16137 Open ini_set / error_reporting inconsistence 16155 Open track_vars doesn't work unless register_globals is also set 16379 Open HTTP_*_VARS disappeared 16430 Analyzed phpinfo displaying wrong default include_path 16582 Open unserialize_callback_func isnt changeable ===============================================[POSIX related]================ 12465 Open posix_* issuing Warnings, no error code. ===============================================[PostgreSQL related]=========== 15255 No Feedback problem in structure control 15896 Feedback Variable lookup table overflow 16466 Open problem with pg_host() ===============================================[Program Execution]============ 3076 Analyzed system and popen are ok in safe_mode, not backquotes 8725 Open Fun with putenv 9912 Open exec calls run programs in the document root: different than PHP3 11430 Open PHP-CGI executing PHP-CGI thru Apache 11546 Analyzed Register_Shutdown_Function doesn't happen after shutdown 11767 Open Bad escape sequence 12300 Open exec() family problems 14897 Open "unable to fork" - cause & solution (well, at least for me) 14997 Open Multiple system calls cause inifinite process forking 15642 Open system() with background execution hangs due to bogus filehandles open 15647 Open exec() only executes internal commands 16032 Open program spawned by backticks or shell_exec does not die when user cancels page 16201 Open sendmail behaves strangely ===============================================[Pspell related]=============== 16288 Open Timeout while checking on a string ===============================================[PWS related]================== 10877 Open HTTP 500 Error and the page cannot be displayed 10943 Open After a migration from php4.0.4 to php4.0.5 11913 Open include() before sending headers causes hang 12446 Open php4isapi.dll path 13332 Open PWS not configured correctly using php406-installer 13593 Open system() & exec() hang 16111 Open PHP will not run 16329 Assigned HTTP/1.1 500 Server Error ===============================================[Recode related]=============== 10813 Feedback recode utf-8..l2 doesn't work 12450 Open Segfaults if recode is loaded after mysql or imap 16481 Open recode doesn't compile with apache 2.0 ===============================================[Regexps related]============== 11253 Open eregi slight mistak? 11461 Open \. after \- does not work 13439 Open unbound .* patterns don't work properly 14989 No Feedback eregi function causes problem in include file 16253 Feedback ereg_replace does'nt work with umlauts ===============================================[Reproducible crash]=========== 8471 Suspended Crash on infinite recursive calls. 12270 No Feedback php4ts.dll crashes due to null-pointer assignment on shutdown 12776 Suspended 4.0.7RC1: array_walk crash 12912 Open Call to round() crashes process (DSO only) 13034 No Feedback Apache segfaults when acessing certain scripts 13093 No Feedback A garbage collection error with an array 13136 No Feedback Crash on shutdown when ODBC connection still open 13437 Open PHP cores on exit; memory deallocation problem? 13898 No Feedback Pb with Apache 14462 Open Red Hat-modified ucd-snmp packages cause php segmentation faults 14679 No Feedback Crash with RH ucd-snmp libs -- BUGFIX 14728 Open Static PHP w/SSL DSO startup crash 14749 Open array_reduce() causes segmentation faults 14750 No Feedback exit signal Floating point exception (8) 14807 Analyzed core dump 14857 Open php.exe crashed during command: show_source(getenv("SCRIPT_FILENAME")); 14929 No Feedback Segmentation fault when using none-deep recursive scripts 14983 Open mail function buffer overflow 15008 Open Apache Crash 15020 Open Segfault - something to do with arBuckets 15051 Open assigning a reference of a part of an array to itself 15058 No Feedback crash on complex page 15062 No Feedback apache crash in php4ts.dll 15102 No Feedback Upload fails (internal error 500) 15106 Open import_request_variables segfault... 15131 Critical XSLT Causing Core Dumps 15156 No Feedback apache segmentation fault (11) with php4 15169 Open ImageCreateFromPng causes Segmentation Fault 15226 Open Element->name not working 15254 Open modules are unloaded in the wrong order 15266 No Feedback segfault when CR in URL and no CR in body 15267 Open "declare" makes apacke crashes under Windows. 15293 No Feedback Incorrect brackets in strlen crashes server 15324 Open CGI version (php.exe) times out 15327 Open copy() causes bus error with files which change size 15397 Feedback include_once bombing on passed value by variable vs string 15437 Open using querries on a database type SELECT * FROM [$tablename] crashes PHP 15450 Open PHP module restarts when using many oracle statements (OCI8) 15472 Open Imap_open crashes php 15489 Open httpd crash with sessions 15665 Open readdir() crashes 15672 Open fread crashes if file larger than 4 KB 15716 Open SAPI under Tomcat 3.2.2(Unexpected exception in native code outside the VM) 15826 Feedback Crash when sending 'authenticate' header 15829 Open using nonexistingn back reference in regex crashes PHP 15834 Open segmentation fault starting apache with pfpro 15858 Open Reproducible segmentation fault in pages using oci8 (Oracle 8.1.7) 15883 Open HTTP_POST_VARS not complete 15888 Open Crashes when using --with-mm 16018 Open PHP crashing (Backtrace included) 16021 Feedback imap_bodystruct call generates signal (via abort()) 16026 Open Segmentation fault in zend_alloc.c 16089 Open The memory could not be "read". 16217 Feedback syslog functions and exit functions are buggy 16221 Open Crash after 50-164 odbc queries on db2 dbase server 16226 Open PHP hangs running WZZIP in some circumstances 16310 Open magic_quotes_runtime 16327 Feedback Apache doesn't start if PHP with IBM DB/2 support is included as a module 16438 Open Segmentation fault 16444 Open zend_llist.c: No such file or directory. 16475 Open apache 2.0.35 crashes with php 4.2.0RC2 and RC3 16558 Open String offset reference can be created and segfaults interpreter ===============================================[Sablotron XSL]================ 15511 Open sablotron and php : segfault in Situation::generateMessage 15666 Open segfault with Sablot-0.82 and php 4.1.1 16376 Open Transformation does not work inside PHP ===============================================[Scripting Engine problem]===== 745 Analyzed <input type=image> and array variables 6231 Analyzed Reference parsing problem 6417 Analyzed Incorrect behaviour with references and arrays 6685 Analyzed %20 mis-converted in GET mechanism 7160 No Feedback Bad escape sequence not being reported 7515 Critical very weird, magic, invisible referencing 9673 Open Relative paths in require(), require_once(), include(), include_once() 9836 Open php unexpectedly ends on too long scripts 9884 Analyzed Using a return in an included file causes a major abnormality. 10120 Analyzed implode(), if empty elements exist 11071 Open probs displaying backslash with HERE statements 11337 Suspended SEGV when using mysql connections in OO-setting 11354 Suspended docs allocated by xmlParseFile need to be freed 11536 Open register_tick_function weirdness 11918 Open Serialization? 11970 Open SEPARATE_ZVAL_TO_MAKE_IS_REF doesn't like 0x0 12203 Analyzed Inconsistent __FILE__ contents when using require/require_once 12278 Analyzed variable variable inside a string 12280 Suspended $file=fopen("http://".$HTTP_SERVER_VARS["SERVER_NAME"].$PHP_SELF, "r"); 12407 Analyzed if else statement correct in 4.0.5 but not 4.0.6 12572 Analyzed sort() doesn't reindex 1 element arrays at 0 12626 Analyzed string to int incorrect if string containts 0 characters 12658 Analyzed set_error_handler() not working properly (with 'Call to undefined function') 12775 Suspended Incorrect result using references and objects 12908 Open zend engine patch (workaround) for some strange bug 13407 Open array index "2147483647" not equivalent to 2147483647 13455 Suspended Using include() with Apache ErrorDocument directive can crash the webserver 13476 Suspended probleme when using &$this in a constructor 13568 Open PHP3 semantics have been retained for nested functions 13588 Open Crash when making a normal string to an array 13600 Open problem with the require function 13616 Suspended Compiler complains about function declaration after return is called 13684 Open Absurd Compie Failure at random times 13757 Analyzed Commandline: querystring parser buggy 13938 Open Windows-newlines are counted twice 14066 Suspended Can't suppress warnigns on accessing invalid string offset 14134 Suspended Literal -2147483648 should be an int, not a double. 14136 Critical Segfaults when forget xslt_free() 14161 Open segfault after strange code 14251 Analyzed register_shutdown_function bug 14365 Open require_once() causes segfault 14491 Analyzed Parser warning that should be parse error 14582 Open initializing with NULL reference 14668 Open wrong bit arithmetics 14678 Open Get Error pages for large php output when accessing pages from internet 14770 Open phps truncates long sources 14833 Analyzed Crash with referense in bogus code 14847 Open relative links for including other scripts do not work anymore 14991 Open ini_set scrambles output 15025 Open Copy of array is affected by reference 15037 Open something wrong with the operator '--' 15136 Open php stopping after having written 16192 chars 15186 Analyzed define/mysql_connect problem 15228 Analyzed variable variable spacing 15241 Open eval() is not allow evaluating code from constants 15297 Open Corrupted html output 15302 Open Warning: open_basedir restriction in effect. ... in Unknown on line 0 15438 Open include_once fails when comparing output to a value 15479 Open problem referencing $_GET using a variable 15589 Open include() output order is weird 15690 Open $PHP_SELF empty 15793 Open inconsistent behaviour for __FILE__ constant 16037 Open random parse errors on dual xeon machine 16080 Analyzed Segmentation fault 16113 Open Circulaire includes makes Apache hang. 16149 Analyzed Memory leak with refcount limit. 16150 Open include_once Broken? 16199 Feedback Loop not looping 16231 Open when using include, __FILE__ prepends / to relative paths 16255 Open Upload Size > 32MB 16265 Suspended Multiply-defined functions in classes not reported 16360 Analyzed Segmentation fault in Array functions 16535 Feedback Line breaks not correctly counted when file has Mac line endings ===============================================[Semaphore related]============ 8985 No Feedback shm_put_var wont put the given var into memory 9259 No Feedback crash when accessing shared memory + more info on bug #8985 ===============================================[Servlet related]============== 16289 Open url with cookie kill tomcat 16331 Open Running phpinfo() kills Tomcat 16402 Open UnsatisfiedLinkError: send when loading any php file ===============================================[Session related]============== 3793 Analyzed session.gc_maxlifetime does not work 5370 No Feedback Session won't pass any variables in this platform. 8545 Open Session variables not carried forward in Netscape Client 11643 Assigned SID redefined 11886 Suspended bug #8908 is still alive in 4.0.6 13182 No Feedback session_start() can't create a _new_ session control file. 13236 Suspended Cycles in object references are not restored correctly 13472 Analyzed input type=hidden should be in a fieldset if there is one (XHTML and trans sid) 13554 No Feedback Storing complex object as session variable makes apache go beserk 13595 Analyzed Solution for "PHP Fatal error: Unable to start session mm module in Unknown on 13834 Analyzed SID already defined 14080 Analyzed (trans sid bug) The doubledoublequote strikes again 14497 Analyzed PHP causes segfault when session handler=user 14529 Analyzed Returning non-string type from session read() segfaults. (User save handler) 14628 Analyzed Session functions block on lock 14688 Feedback session_register() doesn't register 14780 Analyzed Segmentation fault with "mm",PHP works fine with "files" 14798 Critical session.gc_maxlifetime does not work (Reopen Bug ID #3793) 14834 Analyzed SegFault when passing HTTP_SESSION_VARS 14950 Analyzed crash with __sleep() and __wakeup() 15015 No Feedback Session function don't work with PHP loadable module 15041 Analyzed mm save handler does not work 15096 Analyzed Sessions with null session ID in the cookie crash PHP 15168 Analyzed (mm save handler) PHP segfaults saving sessions-vars 15310 Feedback when use object method call session register doesn't work 15359 Analyzed php crashes if temp dir does not exist 15385 Suspended Nested Objects in session crash Both Apache and IIS 15484 No Feedback custom handler of session is not strong enough 15573 Analyzed save_handler mm - doesn't create _SESSION[bar] at the first-time 15644 Feedback Wrong behaviour session.gc_maxlifetime 15657 Analyzed PHP terminated by Windows during session operation 15733 Analyzed The effect of session_set_cookie_params() lasts past a script termination 15856 Feedback session_destroy() - hangs php4ts.dll - memory leak 15875 Feedback Apache segfault while overwriting SessionID 15884 Feedback session_unregister does not work when followed by header("Location: ...") 15895 Analyzed session_unregister('xxx') wo session segfaults 15909 Feedback mysql and header() problem prevent saving session vars(?) 15922 Analyzed Possible segfault 15923 Analyzed unset($_SESSION) does not work 15924 Analyzed mm prevent web server from starting without helpful message 15983 Open session variables lost between pages 15999 Feedback fread() hangs apache when file pointer obtained from a url parameter PHPSESSID 16102 Feedback >1 session variables not getting set correctly 16167 Feedback Variables not passed between pages 16202 Feedback session variables not getting set 16247 Feedback trouble with session_register 16263 Feedback session.start() create new empty session file and not resume existing session 16276 Feedback X-Powered-By session.save_handler=mm 16282 Feedback session data not saved when script ends 16359 Feedback session_id returns empty string if save handler is wddx 16361 Analyzed user can crash apache child entering incorrect session name 16408 Feedback session handling does not work with IE6 16412 Open Using session_start() repeatedly (on different pages) causes HTTP 500 16417 Analyzed session_id() not working 16454 Open Session Mangement, headers, command line 16538 Feedback session data not consistently stored during startup (10-50% failure rate) 16585 Open Use of $_SESSION to set variable doesn't save variable ===============================================[SNMP related]================= 12903 No Feedback snmpwalkoid don't work with SNMPv1 ===============================================[Sockets related]============== 9229 Open Sockets extension does not compile -- possible problem 13666 Open --enable-sockets fails to compile 14261 Feedback fsockopen w/ udp responds incorrectly 14577 Analyzed socket_read() always in binary mode 14740 Analyzed fsockopen() won't timeout 14806 Open server RECV strange if using PHP clients 15040 Open Socket 15091 Open socket_set_timeout not part of windows binary 15214 No Feedback data passed thru the socket staying in memory forever. 15430 Open socket_set_blocking doesn't work 15813 Open >3 step communications 16114 Open fputs doesn't send all data 16261 Open fsockopen() does not timeout 16326 Open socket_set_timeout ===============================================[Solid related]================ 15204 No Feedback "make" command failed (Solid + PHP) ===============================================[Strings related]============== 7472 Analyzed problem with strip_tags() function 10002 Open sprintf() and floating point 11961 Open \r\n or \n 12120 Open Several following < characters ignored by striptags() 12647 Open sprintf, doubles and locale 12982 Open strip_tags() problem with title in <a>-tags 13469 Open get_html_translation_table broken in PHP4.0.6 Apache Module (ONLY) 14217 Open Strange bug with strtr() function 14655 Open ucwords failing randomly with international characters 15097 Open sunstr_count 15683 Open "addslashes" mis-recognises chinese-big5 words with "0xXX 0x5C" 15824 Open magic_quotes_sybase and addslashes/stripslashes 15853 Feedback Problem with Chop function :: Apache/PHP crashes with Dr. Watson error 16293 Open string returned from functions mismatch with variable ===============================================[Sybase (dblib) related]======= 9244 Open sybase-ct does not report MSSQL-server errors 9402 No Feedback never ending cycle 10347 No Feedback Core Dump when selecting TIMESTAMP with FreeTDS and SQL Server 10917 Open Feature request: deal with the BLOB data 11171 No Feedback Faulty MSSQL-queries locks PHP 11188 No Feedback translate national characters in freeeTDS-driver 14354 Open sybase_query returns 1 regardless of delete success 14397 No Feedback Wrong results when reading a float 15701 Open Unable to use DB2 and MSSQL concurrantly 16244 Open nvarchar fields do not return properly with sybase_fetch_*() ===============================================[Sybase-ct (ctlib) related]==== 6571 No Feedback memory leak when selecting text type fields 7609 Analyzed New connections made 7792 Assigned -lsybctl failure at FreeTDS 8313 No Feedback the sysbase type float(15) is handled incorrectly 8954 Assigned compiling with sybase-ct fails 11475 Open stored procedure processing 13474 Open --with-sybase-ct=shared,[DIR] does not result in shared php_sybase_ct.so module 13722 Open mssql text type returns only 255 char 13735 Open exec sybase procedure in .php but only ' 0 'returns! 14167 Open Bug with php_sybase.c and php_sybase.h 15424 Open sybase_pconnect work, sybase_connect segfaults ===============================================[Unknown/Other Function]======= 11831 Open Connection Handling Functions Broken 12979 Open Printing Problems 13338 Open PATH_TRANSLATED variable incorrectly set in v4.0.5 13423 Analyzed gethostbyname() returns hostname when ip address is part of hostname 13979 Open libpq.dll built with MSVCR70.dll (.NET) 14174 Open problem with printer_write() 14270 Open Cannot Successfully map soname 14283 Open printer_create_dc - Example has errors in manual 14301 Open printer_list don't lists the local not shared printers 14512 Analyzed --enable-mbstr-enc-trans breaks parametr parsing 14542 Open connection_status() does not return 2 on timeout 14660 Open license date list not complete 14859 Open cannot print in landscape 14967 Open The php_printer.dll is missing in the ZIP distribution 15100 Open no LICENSE file 15176 Open /kernel: pid 58437 (httpd), uid 65534: exited on signal 11 15253 Open The console version of php crashes 15321 Open GPC/EGPCS Problem 15526 Feedback Uploading of binary file 15555 Open Extra null parameter appearing with func_get_args 15754 Feedback dead link 15818 Open escapeshellarg does not escape characters for win32 15832 No Feedback error when using the copy function 15860 Feedback crypt function returns garbage 15906 Open pcntl_signal() does not work while waiting with socket_accept() 15911 Open call to undefined function in eval ()'ed code causes script to die 15943 Analyzed Viewing .phps Crashes with php.ini-recommended 16020 Open long2ip Returns Incorrect Results 16134 Open wordwrap() with \n 16215 Feedback uasort does not seem to work 16250 Open make error 16270 Open Weird file uploading ===============================================[URL related]================== 14905 No Feedback open() does not accept other ports than 80 ===============================================[Variables related]============ 12243 Open Large numbers not behaving as doubles 12247 Open ternary ?: loses references 13339 Open sscanf returns wrong result 13936 Open Magical Constant __FILE__ contains wrong information on included files 14093 Open Wrong values in the predefined PHP_*DIR constants 14645 Open Problems assigning by reference to globals 14669 Open print_r inconsistancy with newlines 15406 Open Very strange include error 15678 Open isset fails for 4.1.1 and CVS version 16073 Open Cannot unserialize() a string serialized with serialize() 16540 Feedback variables still exist after loading to a new page 16551 Open ceil results -0 ===============================================[Verisign Payflow Pro related]= 12662 No Feedback Payflow modules 15189 Open Segmentation fault __umoddi3 ===============================================[WDDX related]================= 15800 Open german characters cannot be stored ===============================================[Website problem]============== 12373 Analyzed netscape 4.77 stylesheet problem 13311 Open status, severity, and category should be distinct in bug database 13942 Open no way to search bugs from all php versions 14378 Open Search for "this" or "$this" = no results 14813 Open the list of bug categories should be stored in a database table 14816 Open providing a password for every bug report shouldn't be necessary 14985 Open Language when searching on mirrors 15337 Open PHP Bug - Password field should be <input type="password"> 15393 Open Cannot get text to fit browser window @ 800x600 15786 Feedback Patch for 4.1.1 tar.gz file is not a complete file 15870 Feedback your search doesn't work 16309 Open PHP/FI 2.0 Availability Restricted 16312 Critical (SECURITY) Non-CVS users can set statys to anything (including Critical) 16350 Open searching by "OR" 16390 Open bugs.php.net - order by date? 16442 Open bug reporting password finder does not work 16549 Open cvs tags on anoncvs.php ===============================================[XML related]================== 6500 No Feedback XML - startElementHandler 6665 Open object variables get 'unset' when assigned within xml handlers 7133 No Feedback xml_set_object() should not copy the object 9598 No Feedback Variables in class referenced by xml_set_object are not in scope with xml_parse 10254 No Feedback xml_set_object() and segmentation fault 10873 No Feedback internal xmlparser eats only formatted xmlstrings... 11316 No Feedback segfault, possibly in xml functions 11321 No Feedback memory corruption when parsing large XML files 12261 Open xml_parser_get_option doesn't get all option that xml_parser_set_option can set 12286 Open xml_parse isn't returning FALSE with malformed <?xml ...?> element 16472 Open unregistering character handler with XML parser failed ===============================================[XSLT related]================= 16484 Feedback segmentation fault ===============================================[YP/NIS related]=============== 10706 No Feedback yp_next does not report the next entry in the map 11919 Feedback bad return of yp_next ===============================================[Zlib Related]================= 16084 Critical DLLs in the standard distribution using zlib need to be updated 16109 Open zlib.output_compression and generated pictures 16589 Open php 4.2.0rc3+apache2.0.35+zlib crashes while displaying error Assigned bugs: (reminders sent) derick 13961: some characters in incomonig variable names are silently changed derick 1029: printf (& sprintf) dosn't handle exponential format for floats correctly derick 15663: add foreach reference values derick 15140: mcrypt fails for twofish but work properly for all other type of encryption andrei 13289: array_map segfault andrei 8100: extract(), extra feature venaas 14805: array_unique works opposed to the manual yohgaki 14383: using postgres with DBA causes DBA not to be able to find any keys. yohgaki 3276: Add PGP support yohgaki 14924: The POSIX access(2) function is not available yohgaki 12227: Over writing output buffer and returning it causes segfault yohgaki 15245: HTML output is corrupted unless implicit_flush turned on hholzgra 3783: versioning + mysql impossible ! hholzgra 7629: Mail() fails when the email message has a "\n" hholzgra 15171: popen not fully supported hholzgra 7068: fails when 'to:' argument has the form "Name <name@somewhere.xxx>" hholzgra 10136: Function mail() does not work properly hholzgra 10182: problem with the "To" field hholzgra 11165: limit in lenght of mail hholzgra 11247: mail() on Win32 messes with Reply-To: or Errors-To: fields, hholzgra 11348: cannot send email attachments hholzgra 11349: Function not working as documented hholzgra 11616: Cc: & Bcc: not being picked up from header hholzgra 11797: CC and BCC don't work in mail() function hholzgra 11643: SID redefined jmcastagnetto 12212: iSilo PDB documentation seems to be broken zak 14418: PHP and HTML FAQ should be improved zak 14562: dBase: Unable to obtain dBase file structure zak 11652: mysql_data_seek() and mysql_unbuffered_query() warning text zak 11993: mysql_close closes incorrect db handler zak 13589: Persistent connections stay open and accumulate zak 14419: Please use Character-enable mysql_escape zeev 2220: dynamic module memory leaks cause SIGSEGV under DEBUG mode sas 5883: --enable-trans-sid modification request james 7782: Cannot use PATH_INFO fully with php isapi andre 9117: output_handler = ob_gzhandler 13944: in a function, I want to know the file/line that CALLED the function wez 15725: SSL support in FTP wez 16455: "Progress Indicator" of some sort in ftp get jah 6976: ibase_query can't execute SQL statements that can't be prepared jah 7014: ibase_query (rest of php_interbase.dll?) david 6537: mail() does not seem to handle SMTP multi-line responses kalowsky 14262: AccessViolation: oci-Problem rasmus 15919: variables_order not works well imajes 16329: HTTP/1.1 500 Server Error joey 7792: -lsybctl failure at FreeTDS joey 8954: compiling with sybase-ct fails

« previous php.dev (#82760) next »