php 4.2.1 and apache 2.0.39 compile error

From: Date: Wed, 17 Jul 2002 17:07:30 +0000
Subject: php 4.2.1 and apache 2.0.39 compile error
Groups: php.dev 
Request: Send a blank email to php-dev+get-85985@lists.php.net to get a copy of this message
hi guys i am getting this error when compiling php -g -O2 -pthread -DZTS -prefer-pic -c php_functions.c php_functions.c:93:27: missing binary operator before '!' make[3]: *** [php_functions.lo] Error 1 make[3]: Leaving directory `/usr/local/etc/php-4.2.1/sapi/apache2filter' make[2]: *** [all-recursive] Error 1 make[2]: Leaving directory `/usr/local/etc/php-4.2.1/sapi/apache2filter' make[1]: *** [all-recursive] Error 1 make[1]: Leaving directory `/usr/local/etc/php-4.2.1/sapi' make: *** [all-recursive] Error 1 i have also tried the snapshot version of php but then it told me it requires apache 2.40 but there is nowhere to get that ??

« previous php.dev (#85985) next »