Bug #1749: Compile fail on libzend
| From: | vasquezj at lilly dot com | Date: | Tue, 20 Jul 1999 15:34:20 +0000 |
| Subject: | Bug #1749: Compile fail on libzend | ||
| Groups: | php.dev | ||
| Request: | Send a blank email to php-dev+get-8771@lists.php.net to get a copy of this message | ||
From: vasquezj@lilly.com
Operating system: Linux i386 (Redhat 6.0 based)
PHP version: 4.0 Beta 1
PHP Bug Type: Compile Failure
Bug description: Compile fail on libzend
I compiled the php4 package with no problem, but when I went to compile the module into apache
1.3.6, the compile failed. Here is an excerpt from the failure...
gcc -c -I../os/unix -I../include -DLINUX=2 -I/usr/local/src/php-4.0b1
-I/usr/local/src/php-4.0b1/libzend -I/usr/local/src/php-4.0b1/libzend -I/usr/local/src/php-4.0b1
-DUSE_HSREGEX
../apaci util.c
util.c: In function `ap_find_token':
util.c:1292: `test_char_table' undeclared (first use in this function)
util.c:1292: (Each undeclared identifier is reported only once
util.c:1292: for each function it appears in.)
util.c:1292: `T_HTTP_TOKEN_STOP' undeclared (first use in this function)
util.c: In function `ap_escape_shell_cmd':
util.c:1351: `test_char_table' undeclared (first use in this function)
util.c:1351: `T_ESCAPE_SHELL_CMD' undeclared (first use in this function)
util.c: In function `ap_escape_path_segment':
util.c:1475: `test_char_table' undeclared (first use in this function)
util.c:1475: `T_ESCAPE_PATH_SEGMENT' undeclared (first use in this function)
util.c: In function `ap_os_escape_path':
util.c:1504: `test_char_table' undeclared (first use in this function)
util.c:1504: `T_OS_ESCAPE_PATH' undeclared (first use in this function)
make[3]: *** [util.o] Error 1
make[2]: *** [subdirs] Error 1
make[2]: Leaving directory `/usr/local/src/apache_1.3.6/src'
make[1]: *** [build-std] Error 2
make[1]: Leaving directory `/usr/local/src/apache_1.3.6'
make: *** [build] Error 2
I hope this helps! Please let me know if you have any other questions about my setup.
Thanks,
-Jason Vasquez
vasquezj@lilly.com