GD 2.0.6 make errors

From: Date: Thu, 14 Nov 2002 16:51:30 +0000
Subject: GD 2.0.6 make errors
Groups: php.dev 
Request: Send a blank email to php-dev+get-91041@lists.php.net to get a copy of this message
Gcc 3.2 Solaris 9 2.0.1 works fine. Any ideas? Anyone compile 2.0.6 yet on any platform? In file included from gd.c:83: gd_ctx.c: In function `_php_image_output_ctx': gd_ctx.c:70: structure has no member named `free' gd_ctx.c:98: structure has no member named `free' gd.c: In function `_php_image_type': gd.c:1014: structure has no member named `free' gd.c:1017: structure has no member named `free' gd.c: In function `_php_image_create_from': gd.c:1209: structure has no member named `free' make[3]: *** [gd.lo] Error 1 make[2]: *** [all-recursive] Error 1 make[1]: *** [all-recursive] Error 1 make: *** [all-recursive] Error 1 Any ideas

« previous php.dev (#91041) next »