PHP 4.0 Bug #1900: Compiler failes at "soundex.c"

From: Date: Wed, 28 Jul 1999 10:11:33 +0000
Subject: PHP 4.0 Bug #1900: Compiler failes at "soundex.c"
Groups: php.dev 
Request: Send a blank email to php-dev+get-9253@lists.php.net to get a copy of this message
From: straub@i-netpartner.de Operating system: Linux 2.2.3 PHP version: 4.0 Latest CVS (28/07/1999) PHP Bug Type: Compile Failure Bug description: Compiler failes at "soundex.c" gcc -DHAVE_CONFIG_H -I. -I. -I../.. -I../../libzend -I../../TSRM -I../.. -I../../libzend -g -O2 -g -O2 -c soundex.c soundex.c: In function `php3_soundex': soundex.c:80: `code' undeclared (first use this function) soundex.c:80: (Each undeclared identifier is reported only once soundex.c:80: for each function it appears in.) soundex.c:85: `last' undeclared (first use this function) make[2]: *** [soundex.o] Error 1 make[2]: Leaving directory `/usr/src/php4/ext/standard' make[1]: *** [all-recursive] Error 1 make[1]: Leaving directory `/usr/src/php4/ext' make: *** [all-recursive] Error 1

« previous php.dev (#9253) next »