PHP 4.0 Bug #1928: Error at compile time with Informix

From: Date: Fri, 30 Jul 1999 11:24:23 +0000
Subject: PHP 4.0 Bug #1928: Error at compile time with Informix
Groups: php.dev 
Request: Send a blank email to php-dev+get-9343@lists.php.net to get a copy of this message
From: lgallego@uvigo.es Operating system: Linux RedHat 6.0 PHP version: 4.0 Beta 1 PHP Bug Type: Compile Failure Bug description: Error at compile time with Informix *Configure Line: ./configure --with-informix --with-apache=../apache_1.3.6 --enable-track-vars --with-config-file-path=/etc * Error from make output: ... Making all in informix make[2]: Entering directory `/home/temp/web/php-4.0b1/ext/informix' gcc -DHAVE_CONFIG_H -I. -I. -I../.. -I../../libzend -I../../TSRM -I/home/temp/web/php-4.0b1/../apache_1.3.6/src/include -I/home/temp/web/php-4.0b1/../apache_1.3.6/src/os/unix -I/opt/informix/incl/esql -I../.. -I../../libzend -g -O2 -g -I/opt/informix/incl/esql -c ifx.c ifx.ec:130: config.h: No such file or directory ifx.ec:141: php3_string.h: No such file or directory ifx.ec:197: php3_list.h: No such file or directory make[2]: *** [ifx.o] Error 1 make[2]: Leaving directory `/home/temp/web/php-4.0b1/ext/informix' make[1]: *** [all-recursive] Error 1 make[1]: Leaving directory `/home/temp/web/php-4.0b1/ext' make: *** [all-recursive] Error 1 ormix/incl/esql -c ifx.c With php-3.0.11, i compile, with the same options, without problems.

« previous php.dev (#9343) next »