PHP 4.0 Bug #1994: PDF module no longer compiles with PDFlib 0.6

From: Date: Sat, 07 Aug 1999 23:35:16 +0000
Subject: PHP 4.0 Bug #1994: PDF module no longer compiles with PDFlib 0.6
Groups: php.dev 
Request: Send a blank email to php-dev+get-9645@lists.php.net to get a copy of this message
From: mlemos@acm.org Operating system: Linux RH 5.2 PHP version: 4.0 Latest CVS (07/08/1999) PHP Bug Type: Compile Failure Bug description: PDF module no longer compiles with PDFlib 0.6 I configured PHP 4 with --with-pdflib and it has been able to compile just fine until today that I just syncronized with the current CVS repository. PDF lib 0.6 used pdf.h and not pdflib.h as this complains. Also the include path where it was supposed to be found is not included in the compile command line. Making all in pdf make[2]: Entering directory `/root/cvs/php4/ext/pdf' gcc -DHAVE_CONFIG_H -I. -I. -I../.. -I../../libzend -I../../TSRM -I/root/gd1.3 -I/usr/local/Hughes/include -I/usr/include/mysql -I/home/oracle/oracle/app/oracle/product/8.0.5/rdbms/demo -I/home/oracle/oracle/app/oracle/product/8.0.5/network/public -I/home/oracle/oracle/app/oracle/product/8.0.5/plsql/public -I/usr/local/pgsql/include -I/usr/local/include/xml -I../.. -I../../libzend -g -O2 -g -Wall -O2 -c pdf.c In file included from pdf.c:60: php3_pdf.h:36: pdflib.h: No such file or directory make[2]: *** [pdf.o] Error 1 make[2]: Leaving directory `/root/cvs/php4/ext/pdf' make[1]: *** [all-recursive] Error 1 make[1]: Leaving directory `/root/cvs/php4/ext' make: *** [all-recursive] Error 1 [

« previous php.dev (#9645) next »