PHP 4.0 Bug #2064: error compiling ldap.c

From: Date: Sun, 15 Aug 1999 20:38:07 +0000
Subject: PHP 4.0 Bug #2064: error compiling ldap.c
Groups: php.dev 
Request: Send a blank email to php-dev+get-9869@lists.php.net to get a copy of this message
From: chrisvik@tapir.no Operating system: Redhat 6 PHP version: 4.0 Latest CVS (15/08/1999) PHP Bug Type: Compile Failure Bug description: error compiling ldap.c have openldap 1.2.6 installed on my system compiling --with-ldap gcc -DHAVE_CONFIG_H -I. -I. -I../.. -I../../libzend -I../../TSRM -I/usr/src/php4/../apache_1.3.6/src/include -I/usr/src/php4/../apache_1.3.6/src/os/unix -I/usr/include -I../solid/include -I../.. -I../../libzend -g -O2 -O2 -c ldap.c ldap.c:70: `php3_ldap_close' undeclared here (not in a function) ldap.c:70: initializer element for `ldap_functions[1].handler' is not constant make[2]: *** [ldap.o] Error 1 make[2]: Leaving directory `/usr/src/php4/ext/ldap' make[1]: *** [all-recursive] Error 1 make[1]: Leaving directory `/usr/src/php4/ext' make: *** [all-recursive] Error 1

« previous php.dev (#9869) next »