syntax error while compiling php

From: Date: Fri, 21 Jun 2002 14:59:43 +0000
Subject: syntax error while compiling php
Groups: php.general 
Request: Send a blank email to php-general+get-103276@lists.php.net to get a copy of this message
I'm using php-4.2.1 on FreeBSD 4.5 with Apache2, I did the configure fine, I did a './configure --with-mysql --with-apxs2=/usr/local/apache/bin/apxs', but when I do a 'gmake' it comes up with php_functions.c:93: syntax error gmake[3]: *** [php_functions.lo] Error 1 gmake[3]: Leaving directory `/usr2/php-4.2.1/sapi/apache2filter' gmake[2]: *** [all-recursive] Error 1 gmake[2]: Leaving directory `/usr2/php-4.2.1/sapi/apache2filter' gmake[1]: *** [all-recursive] Error 1 gmake[1]: Leaving directory `/usr2/php-4.2.1/sapi' gmake: *** [all-recursive] Error 1 what can I do to fix this? I even tried to just do a 'make' but came up with basically the same thing Dave

« previous php.general (#103276) next »