solaris 10 and php5

From: Date: Tue, 23 Nov 2004 21:24:23 +0000
Subject: solaris 10 and php5
Groups: php.general 
Request: Send a blank email to php-general+get-202730@lists.php.net to get a copy of this message
Hi, i was trying to build php5 in a solaris 10 i386 box and I got stuck with the following error message: In file included from /usr/include/sys/wait.h:24,
                 from /export/home/jonel/Downloads/php-5.0.2/ext/standard/exec.c:33:
/usr/include/sys/siginfo.h:259: error: parse error before "ctid_t" /usr/include/sys/siginfo.h:292: error: parse error before '}' token /usr/include/sys/siginfo.h:294: error: parse error before '}' token /usr/include/sys/siginfo.h:390: error: parse error before "ctid_t" /usr/include/sys/siginfo.h:392: error: conflicting types for `__proc' /usr/include/sys/siginfo.h:261: error: previous declaration of `__proc' /usr/include/sys/siginfo.h:398: error: conflicting types for `__fault' /usr/include/sys/siginfo.h:267: error: previous declaration of `__fault' /usr/include/sys/siginfo.h:404: error: conflicting types for `__file' /usr/include/sys/siginfo.h:273: error: previous declaration of `__file' /usr/include/sys/siginfo.h:420: error: conflicting types for `__prof' /usr/include/sys/siginfo.h:287: error: previous declaration of `__prof' /usr/include/sys/siginfo.h:424: error: conflicting types for `__rctl' /usr/include/sys/siginfo.h:291: error: previous declaration of `__rctl' /usr/include/sys/siginfo.h:426: error: parse error before '}' token /usr/include/sys/siginfo.h:428: error: parse error before '}' token /usr/include/sys/siginfo.h:432: error: parse error before "k_siginfo_t" /usr/include/sys/siginfo.h:437: error: parse error before '}' token In file included from /usr/include/sys/procset.h:24,
                 from /usr/include/sys/wait.h:25,
                 from /export/home/jonel/Downloads/php-5.0.2/ext/standard/exec.c:33:
/usr/include/sys/signal.h:85: error: parse error before "siginfo_t" In file included from /export/home/jonel/Downloads/php-5.0.2/ext/standard/exec.c:33: /usr/include/sys/wait.h:86: error: parse error before "siginfo_t" In file included from /export/home/jonel/Downloads/php-5.0.2/ext/standard/exec.c:36: /usr/include/signal.h:111: error: parse error before "siginfo_t" /usr/include/signal.h:113: error: parse error before "siginfo_t" make: *** [ext/standard/exec.lo] Error 1 I have installed the necessary packages from sunfreeware as required and google it and I seem to hit a wall. anyone have successfully build php5 in a solaris 10? thanks and regards, Jonel

« previous php.general (#202730) next »