help!

From: Date: Wed, 12 Jul 2000 09:56:01 +0000
Subject: help!
Groups: php.general 
Request: Send a blank email to php-general+get-6102@lists.php.net to get a copy of this message
hello, Anyone has incounter this error during compiling with apache? anyway, im using redhat 6.0, gd-1.8.1, php-3.0.12 and apache_1.3.11 Pls help, i cant get out with this error. Thank you very much. /usr/local/lib/libgd.a(gd.o): In function `gdImageColorResolve': gd.o(.text+0x6d0): multiple definition of `gdImageColorResolve' modules/php3/libphp3.a(gd.o):/usr/local/php-3.0.12/functions/gd.c:291: first def ined here /usr/bin/ld: Warning: size of symbol `gdImageColorResolve' changed from 244 to 2 24 in gd.o modules/php3/libphp3.a(gd.o): In function `php3_imagecreatefromgif': /usr/local/php-3.0.12/functions/gd.c:474: undefined reference to `gdImageCreateF romGif' modules/php3/libphp3.a(gd.o): In function `php3_imagegif': /usr/local/php-3.0.12/functions/gd.c:835: undefined reference to `gdImageGif' /usr/local/php-3.0.12/functions/gd.c:853: undefined reference to `gdImageGif' collect2: ld returned 1 exit status make[2]: *** [target_static] Error 1 make[2]: Leaving directory `/usr/local/apache_1.3.11/src' make[1]: *** [build-std] Error 2 make[1]: Leaving directory `/usr/local/apache_1.3.11' make: *** [build] Error 2

« previous php.general (#6102) next »