Re: Relative paths in generator

From: Date: Mon, 25 Apr 2005 18:55:45 +0000
Subject: Re: Relative paths in generator
References: 1 2  Groups: php.gtk.dev 
Request: Send a blank email to php-gtk-dev+get-1142@lists.php.net to get a copy of this message
- so disable combobutton ? I remember there being issues with combobutton before in the Windows build before... ----- Original Message ----- From: "Scott Mattocks" <scott@crisscott.com> To: "Scott Mattocks" <scott@crisscott.com> Cc: <php-gtk-dev@lists.php.net> Sent: Monday, April 25, 2005 7:45 PM Subject: Re: [PHP-GTK-DEV] Relative paths in generator > Here is the result of my latest make efforts. The attached file has the > full results of > $ make 2> make.errors > > Thanks, > Scott > > > /home/scott/src/php-gtk/ext/combobutton/gtkcombobutton.c: In function > `gtk_combobutton_class_init': > /home/scott/src/php-gtk/ext/combobutton/gtkcombobutton.c:130: error: > structure has no member named `type' > /home/scott/src/php-gtk/ext/combobutton/gtkcombobutton.c:141: error: > structure has no member named `draw' > /home/scott/src/php-gtk/ext/combobutton/gtkcombobutton.c: In function > `gtk_combobutton_init': > /home/scott/src/php-gtk/ext/combobutton/gtkcombobutton.c:156: error: > structure has no member named `child' > /home/scott/src/php-gtk/ext/combobutton/gtkcombobutton.c: In function > `gtk_combobutton_size_request': > /home/scott/src/php-gtk/ext/combobutton/gtkcombobutton.c:532: error: > structure has no member named `klass' > /home/scott/src/php-gtk/ext/combobutton/gtkcombobutton.c:536: error: > structure has no member named `klass' > /home/scott/src/php-gtk/ext/combobutton/gtkcombobutton.c:540: error: > structure has no member named `klass' > /home/scott/src/php-gtk/ext/combobutton/gtkcombobutton.c:542: error: > structure has no member named `klass' > /home/scott/src/php-gtk/ext/combobutton/gtkcombobutton.c: In function > `gtk_combobutton_size_allocate': > > ---------------------------------------------------------------------------- ---- > Parsing file "atk.defs". > Parsing file "atk-types.defs". > Parsing file "pango-types.defs". > Parsing file "gdk-types.defs". > Parsing file "gtk-types.defs". > Parsing file "ext/gtk+/atk-types.defs". > Parsing file "pango.defs". > Loading cache "atk-types.defs.cache" > Loading cache "pango-types.defs.cache" > Loading cache "gdk-types.defs.cache" > Loading cache "gtk-types.defs.cache" > Parsing file "ext/gtk+/pango-types.defs". > Parsing file "gdk.defs". > Loading cache "atk-types.defs.cache" > Loading cache "pango-types.defs.cache" > Loading cache "gdk-types.defs.cache" > Loading cache "gtk-types.defs.cache" > Parsing file "ext/gtk+/gdk-types.defs". > Parsing file "gtk.defs". > Loading cache "atk-types.defs.cache" > Loading cache "pango-types.defs.cache" > Loading cache "gdk-types.defs.cache" > Loading cache "gtk-types.defs.cache" > Parsing file "ext/gtk+/gtk-extrafuncs.defs". > Parsing file "ext/gtk+/gtk-types.defs". > ext/gtk+/gtk.overrides: In function `zif_GtkRadioToolButton___construct': > ext/gtk+/gtk.overrides:819: warning: comparison between pointer and integer > ext/gtk+/gtk.overrides: In function `zif_GtkRadioButton___construct': > ext/gtk+/gtk.overrides:775: warning: comparison between pointer and integer > /home/scott/src/php-gtk/ext/combobutton/gtkcombobutton.c: In function `gtk_combobutton_class_init': > /home/scott/src/php-gtk/ext/combobutton/gtkcombobutton.c:130: error: structure has no member named `type' > /home/scott/src/php-gtk/ext/combobutton/gtkcombobutton.c:141: error: structure has no member named `draw' > /home/scott/src/php-gtk/ext/combobutton/gtkcombobutton.c: In function `gtk_combobutton_init': > /home/scott/src/php-gtk/ext/combobutton/gtkcombobutton.c:156: error: structure has no member named `child' > /home/scott/src/php-gtk/ext/combobutton/gtkcombobutton.c: In function `gtk_combobutton_size_request': > /home/scott/src/php-gtk/ext/combobutton/gtkcombobutton.c:532: error: structure has no member named `klass' > /home/scott/src/php-gtk/ext/combobutton/gtkcombobutton.c:536: error: structure has no member named `klass' > /home/scott/src/php-gtk/ext/combobutton/gtkcombobutton.c:540: error: structure has no member named `klass' > /home/scott/src/php-gtk/ext/combobutton/gtkcombobutton.c:542: error: structure has no member named `klass' > /home/scott/src/php-gtk/ext/combobutton/gtkcombobutton.c: In function `gtk_combobutton_size_allocate': > /home/scott/src/php-gtk/ext/combobutton/gtkcombobutton.c:584: error: structure has no member named `klass' > /home/scott/src/php-gtk/ext/combobutton/gtkcombobutton.c:585: error: structure has no member named `klass' > /home/scott/src/php-gtk/ext/combobutton/gtkcombobutton.c:597: error: structure has no member named `klass' > /home/scott/src/php-gtk/ext/combobutton/gtkcombobutton.c:599: error: structure has no member named `klass' > /home/scott/src/php-gtk/ext/combobutton/gtkcombobutton.c:601: error: structure has no member named `klass' > /home/scott/src/php-gtk/ext/combobutton/gtkcombobutton.c:601: error: structure has no member named `klass' > /home/scott/src/php-gtk/ext/combobutton/gtkcombobutton.c:603: error: structure has no member named `klass' > /home/scott/src/php-gtk/ext/combobutton/gtkcombobutton.c:603: error: structure has no member named `klass' > /home/scott/src/php-gtk/ext/combobutton/gtkcombobutton.c: In function `gtk_combobutton_paint': > /home/scott/src/php-gtk/ext/combobutton/gtkcombobutton.c:671: error: structure has no member named `klass' > /home/scott/src/php-gtk/ext/combobutton/gtkcombobutton.c:672: error: structure has no member named `klass' > /home/scott/src/php-gtk/ext/combobutton/gtkcombobutton.c:725: error: incompatible type for argument 3 of `gtk_paint_focus' > /home/scott/src/php-gtk/ext/combobutton/gtkcombobutton.c:725: warning: passing arg 4 of `gtk_paint_focus' from incompatible pointer type > /home/scott/src/php-gtk/ext/combobutton/gtkcombobutton.c:725: warning: passing arg 5 of `gtk_paint_focus' from incompatible pointer type > /home/scott/src/php-gtk/ext/combobutton/gtkcombobutton.c:725: warning: passing arg 6 of `gtk_paint_focus' makes pointer from integer without a cast > /home/scott/src/php-gtk/ext/combobutton/gtkcombobutton.c:725: error: too few arguments to function `gtk_paint_focus' > /home/scott/src/php-gtk/ext/combobutton/gtkcombobutton.c: In function `gtk_combobutton_button_press': > /home/scott/src/php-gtk/ext/combobutton/gtkcombobutton.c:827: warning: passing arg 4 of `gtk_menu_popup' from incompatible pointer type > make: *** [ext/combobutton/gtkcombobutton.lo] Error 1 > > ---------------------------------------------------------------------------- ---- > -- > PHP-GTK Development Mailing List (http://gtk.php.net/) > To unsubscribe, visit: http://www.php.net/unsub.php

« previous php.gtk.dev (#1142) next »