Re: Trouble compiling on 2005-11-18

From: Date: Sat, 19 Nov 2005 19:29:08 +0000
Subject: Re: Trouble compiling on 2005-11-18
References: 1  Groups: php.gtk.dev 
Request: Send a blank email to php-gtk-dev+get-2078@lists.php.net to get a copy of this message
You must be using the latest CVS version of PHP 5.1. There were some changes related to supporting recursive __get/__set handlers and I have not had a chance to update PHP-GTK correspondingly. -Andrei On Nov 18, 2005, at 1:42 PM, Werner wrote:
Hi everyone I'm stuck during php-gtk compilation on Suse Pro 9.3. I am re-following the instructions on 'http://gtk.php.net/wiki/PhpGtk2/InstallingOnUnix'. Everything went fine until making php-gtk after a recent cvs checkout. I am not a gcc guru, but I will do anything to help debug, etc. since I love the PHP-GTK project so much! Therefore, please let me know if there is any testing, etc (or any other humble/non-guru work) that I can do, or where I can lend a more general hand of help to you guys with the PHP-GTK2 project. This is where I got stuck during make: gcc -I/root/temp/php-5-1-cvs/php-gtk/main -I. -I/root/temp/php-5-1-cvs/php-gtk -DPHP_ATOM_INC -I/root/temp/php-5-1-cvs/php-gtk/include -I/root/temp/php-5-1-cvs/php-gtk/main -I/root/temp/php-5-1-cvs/php-gtk -I/opt/php_5_1/include/php -I/opt/php_5_1/include/php/main -I/opt/php_5_1/include/php/TSRM -I/opt/php_5_1/include/php/Zend -I/opt/php_5_1/include/php/ext -I/opt/gnome/include/glib-2.0 -I/opt/gnome/lib/glib-2.0/include -I/opt/gnome/include/gtk-2.0 -I/opt/gnome/lib/gtk-2.0/include -I/usr/X11R6/include -I/opt/gnome/include/atk-1.0 -I/opt/gnome/include/pango-1.0 -I/usr/include/freetype2 -I/usr/include/freetype2/config -DHAVE_CONFIG_H -g -O2 -c /root/temp/php-5-1-cvs/php-gtk/main/phpg_support.c -fPIC -DPIC -o main/.libs/phpg_support.o /root/temp/php-5-1-cvs/php-gtk/main/phpg_support.c: In function `phpg_init_object': /root/temp/php-5-1-cvs/php-gtk/main/phpg_support.c:246: error: structure has no member named `in_get' /root/temp/php-5-1-cvs/php-gtk/main/phpg_support.c:247: error: structure has no member named `in_set' make: *** [main/phpg_support.lo] Error 1 Is this a temporary problem? Thank you for your time and effort, Werner --PHP-GTK Development Mailing List (http://gtk.php.net/) To unsubscribe, visit: http://www.php.net/unsub.php


« previous php.gtk.dev (#2078) next »