Re: Error compiling treeviewoverrides

From: Date: Fri, 28 Apr 2006 13:49:04 +0000
Subject: Re: Error compiling treeviewoverrides
References: 1  Groups: php.gtk.dev 
Request: Send a blank email to php-gtk-dev+get-2790@lists.php.net to get a copy of this message
Fixed, but next time, just fix it. It's simple enough. :) -Andrei On Apr 27, 2006, at 11:01 AM, Christian Weiske wrote:
Hi all, I just updated the sources and tried to compile them, however I get the following error: ------------------- ext/gtk+/gtktreeview.overrides: In function `zif_GtkTreeModel_get': ext/gtk+/gtktreeview.overrides:1273: error: `false' undeclared (first use in this function) ext/gtk+/gtktreeview.overrides:1273: error: (Each undeclared identifier is reported only once ext/gtk+/gtktreeview.overrides:1273: error: for each function it appears in.) ext/gtk+/gtktreeview.overrides:1280: error: `true' undeclared (first use in this function) ext/gtk+/gtktreeview.overrides:1298: warning: unused variable `column' make: *** [ext/gtk+/gen_gtk.lo] Error 1 ------------------- When I replace the lines
zend_bool varargs = false; varargs = false; varargs = true;
with
zend_bool varargs = 0; varargs = 0; varargs = 1;
it works, but I don't know why false/true isn't recognized as zend_bool. --Regards/MfG, Christian Weiske


« previous php.gtk.dev (#2790) next »