Problem compiling from current cvs

From: Date: Sat, 16 Feb 2008 08:43:17 +0000
Subject: Problem compiling from current cvs
Groups: php.gtk.dev 
Request: Send a blank email to php-gtk-dev+get-4122@lists.php.net to get a copy of this message
Hello, I get an error when trying to compile current cvs: ext/gtk+/gtktreeview.overrides: In function 'zim_GtkListStore_insert': ext/gtk+/gtktreeview.overrides:454: warning: passing argument 2 of 'phpg_gvalue_from_zval' from incompatible pointer type ext/gtk+/gtktreeview.overrides: In function 'zim_GtkListStore_insert_after': ext/gtk+/gtktreeview.overrides:519: warning: passing argument 2 of 'phpg_gvalue_from_zval' from incompatible pointer type ext/gtk+/gtktreeview.overrides: In function 'zim_GtkListStore_insert_before': ext/gtk+/gtktreeview.overrides:570: warning: passing argument 2 of 'phpg_gvalue_from_zval' from incompatible pointer type ext/gtk+/gtktreeview.overrides: In function 'phpg_store_set_impl': ext/gtk+/gtktreeview.overrides:650: warning: passing argument 2 of 'phpg_gvalue_from_zval' from incompatible pointer type ext/gtk+/gtk.overrides: In function 'phpg_file_filter_add_custom_marshal_add_file': ext/gtk+/gtk.overrides:2796: error: 'tsrm_ls' undeclared (first use in this function) ext/gtk+/gtk.overrides:2796: error: (Each undeclared identifier is reported only once ext/gtk+/gtk.overrides:2796: error: for each function it appears in.) ext/gtk+/gtk.overrides: In function 'zim_GtkEntry_get_invisible_char': ext/gtk+/gtk.overrides:2636: warning: cast to pointer from integer of different size ext/gtk+/gtk.overrides: In function 'zim_GtkButton_new_from_stock': ext/gtk+/gtk.overrides:1347: error: too few arguments to function 'phpg_gtype_from_class' ext/gtk+/gtktextview.overrides: In function 'zim_GtkTextIter_get_char': ext/gtk+/gtktextview.overrides:306: warning: cast to pointer from integer of different size make: *** [ext/gtk+/gen_gtk.lo] Fehler 1 -- Regards/Mit freundlichen Grüßen Christian Weiske

Attachment: [application/pgp-signature] signature.asc
« previous php.gtk.dev (#4122) next »