#44365 [Com]: php-gtk-2.0.0 compile failed w/ USE=sourceview"
| From: | jakub at gentoo dot org | Date: | Sat, 08 Mar 2008 07:46:58 +0000 |
| Subject: | #44365 [Com]: php-gtk-2.0.0 compile failed w/ USE=sourceview" | ||
| References: | 1 | Groups: | php.gtk.dev |
| Request: | Send a blank email to php-gtk-dev+get-4173@lists.php.net to get a copy of this message | ||
ID: 44365
Comment by: jakub at gentoo dot org
Reported By: zach9824 at gmail dot com
Status: Feedback
Bug Type: PHP-GTK related
Operating System: Gentoo Linux
PHP Version: 5.2.6RC2
Assigned To: bmajdak
New Comment:
That's exactly what the ebuild does, but it doesn't work. ;)
Previous Comments:
------------------------------------------------------------------------
[2008-03-07 20:05:24] bmajdak@php.net
Please attempt at compiling the tarball with the following configure
line:
./buildconf && ./configure --with-sourceview and if this works,
contact the authour of your ebuild. We do not really know how to deal
with Gentoo related things.
------------------------------------------------------------------------
[2008-03-07 19:32:41] zach9824 at gmail dot com
Description:
------------
as per my report http://bugs.gentoo.org/show_bug.cgi?id=212595.
Appears
PHP-GTK-2 stable will not build with sourceview enabled. Listed below is
some specific info. You can see additional details in link above.
If you need additional testing or information please feel free to
contact me.
1) emerge php-gtk
ext/sourceview/sourceview.overrides: In function
'zim_GtkSourceView_forward_search':
ext/sourceview/sourceview.overrides:303: error: 'tsrm_ls' redeclared
as
different kind of symbol
ext/sourceview/sourceview.overrides:294: error: previous definition of
'tsrm_ls' was here
ext/sourceview/sourceview.overrides: In function
'zim_GtkSourceView_backward_search':
ext/sourceview/sourceview.overrides:349: error: 'tsrm_ls' redeclared
as
different kind of symbol
ext/sourceview/sourceview.overrides:340: error: previous definition of
'tsrm_ls' was here
make: *** [ext/sourceview/gen_sourceview.lo] Error 1
*
* ERROR: dev-php5/php-gtk-2.0.0 failed.
* Call stack:
* ebuild.sh, line 49: Called src_compile
* environment, line 3602: Called die
* The specific snippet of code:
* emake || die "make failed!";
* The die message:
* make failed!
*
* If you need support, post the topmost build error, and the call
stack if
relevant.
------------------------------------------------------------------------
--
Edit this bug report at http://bugs.php.net/?id=44365&edit=1