Bug #55579 [NEW]: buildconf fails

From: Date: Sun, 04 Sep 2011 08:53:42 +0000
Subject: Bug #55579 [NEW]: buildconf fails
Groups: php.gtk.dev 
Request: Send a blank email to php-gtk-dev+get-4524@lists.php.net to get a copy of this message
From: cweiske Operating system: PHP version: 5.3.8 Package: PHP-GTK related Bug Type: Bug Bug description:buildconf fails Description: ------------ Running ./buildconf from a fresh svn checkout fails. It's a Ubuntu 11.04 system with php 5.3.5 Actual result: -------------- cweiske:~/Dev/php.net/php-gtk> ./buildconf Configuring for: PHP Api Version: 20090626 Zend Module Api No: 20090626 Zend Extension Api No: 220090626 rebuilding aclocal.m4 rebuilding configure configure.in:150: warning: LTOPTIONS_VERSION is m4_require'd but not m4_defun'd aclocal.m4:2950: LT_INIT is expanded from... aclocal.m4:2985: AC_PROG_LIBTOOL is expanded from... configure.in:150: the top level configure.in:150: warning: LTSUGAR_VERSION is m4_require'd but not m4_defun'd configure.in:150: warning: LTVERSION_VERSION is m4_require'd but not m4_defun'd configure.in:150: warning: LTOBSOLETE_VERSION is m4_require'd but not m4_defun'd configure:12127: error: possibly undefined macro: m4_ifval If this token and others are legitimate, please use m4_pattern_allow. See the Autoconf documentation. configure:15154: error: possibly undefined macro: _LT_SET_OPTIONS configure:15154: error: possibly undefined macro: LT_INIT make[1]: *** [configure] Fehler 1 make: *** [all] Fehler 2 -- Edit bug report at https://bugs.php.net/bug.php?id=55579&edit=1 -- Try a snapshot (PHP 5.4): https://bugs.php.net/fix.php?id=55579&r=trysnapshot54 Try a snapshot (PHP 5.3): https://bugs.php.net/fix.php?id=55579&r=trysnapshot53 Try a snapshot (trunk): https://bugs.php.net/fix.php?id=55579&r=trysnapshottrunk Fixed in SVN: https://bugs.php.net/fix.php?id=55579&r=fixed Fixed in SVN and need be documented: https://bugs.php.net/fix.php?id=55579&r=needdocs Fixed in release: https://bugs.php.net/fix.php?id=55579&r=alreadyfixed Need backtrace: https://bugs.php.net/fix.php?id=55579&r=needtrace Need Reproduce Script: https://bugs.php.net/fix.php?id=55579&r=needscript Try newer version: https://bugs.php.net/fix.php?id=55579&r=oldversion Not developer issue: https://bugs.php.net/fix.php?id=55579&r=support Expected behavior: https://bugs.php.net/fix.php?id=55579&r=notwrong Not enough info: https://bugs.php.net/fix.php?id=55579&r=notenoughinfo Submitted twice: https://bugs.php.net/fix.php?id=55579&r=submittedtwice register_globals: https://bugs.php.net/fix.php?id=55579&r=globals PHP 4 support discontinued: https://bugs.php.net/fix.php?id=55579&r=php4 Daylight Savings: https://bugs.php.net/fix.php?id=55579&r=dst IIS Stability: https://bugs.php.net/fix.php?id=55579&r=isapi Install GNU Sed: https://bugs.php.net/fix.php?id=55579&r=gnused Floating point limitations: https://bugs.php.net/fix.php?id=55579&r=float No Zend Extensions: https://bugs.php.net/fix.php?id=55579&r=nozend MySQL Configuration Error: https://bugs.php.net/fix.php?id=55579&r=mysqlcfg

« previous php.gtk.dev (#4524) next »