Re: Compiling PHP-GTK2

From: Date: Tue, 01 Feb 2005 16:34:09 +0000
Subject: Re: Compiling PHP-GTK2
References: 1  Groups: php.gtk.dev 
Request: Send a blank email to php-gtk-dev+get-909@lists.php.net to get a copy of this message
Hello, Here is what I got when trying to compile last night (2005-01-31) with the latest CVS files: make: *** [ext/gtk+/gen_gtk.lo] Error 1 ext/gtk+/gen_gtk.c: In function `phpg_GtkTextAttributes_read_bg_color': ext/gtk+/gen_gtk.c:27510: error: structure has no member named `bg_color' ext/gtk+/gen_gtk.c: In function `phpg_GtkTextAttributes_read_fg_color': ext/gtk+/gen_gtk.c:27521: error: structure has no member named `fg_color' make: *** [ext/gtk+/gen_gtk.lo] Error 1 I would assume that the CVS files are not always supposed to compile since it is still a work in progress. Is there any CVS tag that I can use for the last know compileable files? Thanks, Scott

« previous php.gtk.dev (#909) next »