new errors

From: Date: Tue, 23 Sep 2003 17:29:58 +0000
Subject: new errors
Groups: php.install 
Request: Send a blank email to php-install+get-11950@lists.php.net to get a copy of this message
I downloaded a new gcc3.3. The old error messages disappear. But encounter some new errors. What went wrong? Thanks, Edwin In file included from /opt/php-4.3.0/ext/xslt/sablot.c:36: /opt/php-4.3.0/include/php_sab_info.h:1:18: missing terminating " character In file included from /opt/php-4.3.0/ext/xslt/sablot.c:36: /opt/php-4.3.0/include/php_sab_info.h:2: error: parse error before ':' token /opt/php-4.3.0/include/php_sab_info.h:3:19: missing terminating " character In file included from /usr/include/fcntl.h:24,
                from /opt/php-4.3.0/ext/xslt/sablot.c:44:
/usr/include/sys/fcntl.h:172: error: parse error before '}' token make: *** [ext/xslt/sablot.lo] Error 1 _________________________________________________________________ Instant message in style with MSN Messenger 6.0. Download it now FREE! http://msnmessenger-download.com

« previous php.install (#11950) next »