Compilation Failure of dns.lo on Mac OS X 10.3

From: Date: Mon, 27 Oct 2003 15:50:59 +0000
Subject: Compilation Failure of dns.lo on Mac OS X 10.3
Groups: php.install 
Request: Send a blank email to php-install+get-12132@lists.php.net to get a copy of this message
Spent the weekend installing Mac OS X 10.3 "Panther". When I try to compile the latest php (4.3.3), I get errors [1]. This is the command I use to compile: % ./configure && make I did a google search for "php T_MX" and found somebody had the same problem, but nobody ever offered a solution. Can anyone help? Thanks.
     <:> Aaron Jensen
     <:> aaron@visualprose.com
     <:> Visual Prose, Inc
     <:> www.visualprose.com
[1] Here are the errors: /Users/atjensen/Desktop/php/ext/standard/dns.c: In function `zif_checkdnsrr': /Users/atjensen/Desktop/php/ext/standard/dns.c:228: error: `T_MX' undeclared (first use in this function) /Users/atjensen/Desktop/php/ext/standard/dns.c:228: error: (Each undeclared identifier is reported only once /Users/atjensen/Desktop/php/ext/standard/dns.c:228: error: for each function it appears in.) /Users/atjensen/Desktop/php/ext/standard/dns.c:239: error: `T_A' undeclared (first use in this function) /Users/atjensen/Desktop/php/ext/standard/dns.c:240: error: `T_NS' undeclared (first use in this function) /Users/atjensen/Desktop/php/ext/standard/dns.c:242: error: `T_PTR' undeclared (first use in this function) /Users/atjensen/Desktop/php/ext/standard/dns.c:243: error: `T_ANY' undeclared (first use in this function) /Users/atjensen/Desktop/php/ext/standard/dns.c:244: error: `T_SOA' undeclared (first use in this function) /Users/atjensen/Desktop/php/ext/standard/dns.c:245: error: `T_CNAME' undeclared (first use in this function) /Users/atjensen/Desktop/php/ext/standard/dns.c:256: error: `C_IN' undeclared (first use in this function) /Users/atjensen/Desktop/php/ext/standard/dns.c: In function `zif_getmxrr': /Users/atjensen/Desktop/php/ext/standard/dns.c:288: error: `HEADER' undeclared (first use in this function) /Users/atjensen/Desktop/php/ext/standard/dns.c:288: error: `hp' undeclared (first use in this function) /Users/atjensen/Desktop/php/ext/standard/dns.c:317: error: `C_IN' undeclared (first use in this function) /Users/atjensen/Desktop/php/ext/standard/dns.c:317: error: `T_MX' undeclared (first use in this function) /Users/atjensen/Desktop/php/ext/standard/dns.c:324: error: parse error before ')' token make: *** [ext/standard/dns.lo] Error 1

« previous php.install (#12132) next »