./configure --with-imap --with-kerberos
| From: | Jose Santana | Date: | Thu, 11 Nov 2004 17:47:06 +0000 |
| Subject: | ./configure --with-imap --with-kerberos | ||
| Groups: | php.install | ||
| Request: | Send a blank email to php-install+get-14706@lists.php.net to get a copy of this message | ||
Current Folder: INBOX Sign Out
Compose Addresses Folders Options Search Help Fetch Calendar
To Do Bookmarks Notes SquirrelMail
Message List | Delete Previous | Next Forward | Forward as Attachment |
Reply | Reply All
From: "root" <root@wsgrhl730.law.columbia.edu>
Date: Thu, November 11, 2004 12:32 pm
Priority: Normal
Options: View Full Header | View Printable Version
Block Sender
Block Sender's Domain| Add to Addressbook
This file contains any messages produced by compilers while
running configure, to aid debugging if configure makes a mistake.
configure:1638: checking host system type
configure:1726: checking for gcc
configure:1839: checking whether the C compiler (gcc ) works
configure:1855: gcc -o conftest conftest.c 1>&5
configure:1881: checking whether the C compiler (gcc ) is a cross-compiler
configure:1886: checking whether we are using GNU C
configure:1895: gcc -E conftest.c
configure:1914: checking whether gcc accepts -g
configure:1947: checking whether gcc and cc understand -c and -o together
configure:1962: gcc -c conftest.c -o conftest.o 1>&5
configure:1963: gcc -c conftest.c -o conftest.o 1>&5
configure:1968: cc -c conftest.c 1>&5
configure:1970: cc -c conftest.c -o conftest.o 1>&5
configure:1971: cc -c conftest.c -o conftest.o 1>&5
configure:1998: checking how to run the C preprocessor
configure:2019: gcc -E conftest.c >/dev/null 2>conftest.out
configure:2079: checking for AIX
configure:2106: checking if compiler supports -R
configure:2121: gcc -o conftest -g -O2 conftest.c -R /usr/lib 1>&5
gcc: unrecognized option `-R'
/usr/lib: file not recognized: Is a directory
collect2: ld returned 1 exit status
configure: failed program was:
#line 2114 "configure"
#include "confdefs.h"
int main() {
; return 0; }
configure:2139: checking if compiler supports -Wl,-rpath,
configure:2154: gcc -o conftest -g -O2 conftest.c -Wl,-rpath,/usr/lib 1>&5
configure:2180: checking for re2c
configure:2211: checking for ranlib
configure:2239: checking whether ln -s works
configure:2264: checking for mawk
configure:2264: checking for gawk
configure:2298: checking for bison
configure:2332: checking bison version
configure:2342: checking for flex
configure:2376: checking for yywrap in -lfl
configure:2395: gcc -o conftest -g -O2 conftest.c -lfl 1>&5
configure:2419: checking lex output file root
configure:2440: checking whether yytext is a pointer
configure:2459: gcc -o conftest -g -O2 conftest.c -lfl 1>&5
configure:2483: checking for working const
configure:2537: gcc -c -g -O2 conftest.c 1>&5
configure:2562: checking flex version
configure:2706: gcc -o conftest -g -O2 conftest.c 1>&5
/tmp/ccK1icEf.o(.text+0x20): In function `main':
/software/php-4.3.9/configure:2701: undefined reference to
`pthread_mutexattr_init'
/tmp/ccK1icEf.o(.text+0x34):/software/php-4.3.9/configure:2702: undefined
reference
to `pthread_create'
collect2: ld returned 1 exit status
configure: failed program was:
#line 2688 "configure"
#include "confdefs.h"
#include <pthread.h>
#include <stddef.h>
void *thread_routine(void *data) {
return data;
}
int main() {
pthread_t thd;
pthread_mutexattr_t mattr;
int data = 1;
pthread_mutexattr_init(&mattr);
return pthread_create(&thd, NULL, thread_routine, &data);
}
configure:2726: checking for pthreads_cflags
configure:2759: gcc -o conftest -g -O2 -kthread conftest.c 1>&5
gcc: unrecognized option `-kthread'
/tmp/cc6eI1Kv.o(.text+0x20): In function `main':
/software/php-4.3.9/configure:2754: undefined reference to
`pthread_mutexattr_init'
/tmp/cc6eI1Kv.o(.text+0x34):/software/php-4.3.9/configure:2755: undefined
reference
to `pthread_create'
collect2: ld returned 1 exit status
configure: failed program was:
#line 2741 "configure"
#include "confdefs.h"
#include <pthread.h>
#include <stddef.h>
void *thread_routine(void *data) {
return data;
}
int main() {
pthread_t thd;
pthread_mutexattr_t mattr;
int data = 1;
pthread_mutexattr_init(&mattr);
return pthread_create(&thd, NULL, thread_routine, &data);
}
configure:2759: gcc -o conftest -g -O2 -pthread conftest.c 1>&5
configure:2789: checking for pthreads_lib
configure:2915: checking for AOLserver support
configure:3135: checking for Apache 1.x module support via DSO through APXS
configure:3418: checking for Apache 1.x module support
configure:4199: checking for member fd in BUFF *
configure:4218: gcc -c -g -O2 conftest.c 1>&5
configure:4212:19: httpd.h: No such file or directory
configure: In function `main':
configure:4214: error: `conn_rec' undeclared (first use in this function)
configure:4214: error: (Each undeclared identifier is reported only once
configure:4214: error: for each function it appears in.)
configure:4214: error: `c' undeclared (first use in this function)
configure: failed program was:
#line 4211 "configure"
#include "confdefs.h"
#include <httpd.h>
int main() {
conn_rec *c; int fd = c->client->fd;
; return 0; }
configure:4242: checking for mod_charset compatibility option
configure:4309: checking for Apache 2.0 filter-module support via DSO
through APXS
configure:5045: checking for Apache 2.0 handler-module support via DSO
through APXS
configure:5782: checking for Caudium support
configure:6092: checking for CLI build
configure:6152: checking for embedded SAPI library support
configure:6335: checking for Zeus ISAPI support
configure:6545: checking for NSAPI support
configure:6866: checking for PHTTPD support
configure:7075: checking for Pi3Web support
configure:7384: checking for Roxen/Pike support
configure:7633: checking for Servlet support
configure:8111: checking for thttpd
configure:8317: checking for TUX
configure:8531: checking for webjames
configure:8605: checking for CGI build
configure:8629: checking whether writing to stdout works
configure:8658: gcc -o conftest -g -O2 conftest.c 1>&5
configure:8687: checking whether to force Apache CGI redirect
configure:8701: checking whether to discard path_info + path_translated
configure:8714: checking whether to enable path info checking
configure:8727: checking whether to enable fastcgi support
configure:8932: checking for chosen SAPI module
configure:9837: checking for missing declarations of reentrant functions
configure:9846: gcc -c -g -O2 conftest.c 1>&5
configure:9871: gcc -c -g -O2 conftest.c 1>&5
configure:9896: gcc -c -g -O2 conftest.c 1>&5
configure:9921: gcc -c -g -O2 conftest.c 1>&5
configure:9946: gcc -c -g -O2 conftest.c 1>&5
configure:9970: checking for sendmail
configure:10011: checking whether system uses EBCDIC
configure:10030: gcc -o conftest -g -O2 conftest.c 1>&5
configure: failed program was:
#line 10022 "configure"
#include "confdefs.h"
int main(void) {
return (unsigned char)'A' != (unsigned char)0xC1;
}
configure:10104: checking for socket
configure:10132: gcc -o conftest -g -O2 conftest.c 1>&5
configure:10361: checking for htonl
configure:10389: gcc -o conftest -g -O2 conftest.c 1>&5
configure:10618: checking for gethostname
configure:10646: gcc -o conftest -g -O2 conftest.c 1>&5
configure:10875: checking for gethostbyaddr
configure:10903: gcc -o conftest -g -O2 conftest.c 1>&5
configure:11132: checking for yp_get_default_domain
configure:11160: gcc -o conftest -g -O2 conftest.c 1>&5
/tmp/cc02ysis.o(.text+0xa): In function `main':
/software/php-4.3.9/configure:11154: undefined reference to
`yp_get_default_domain'
collect2: ld returned 1 exit status
configure: failed program was:
#line 11137 "configure"
#include "confdefs.h"
/* System header to define __stub macros and hopefully few prototypes,
which can conflict with char yp_get_default_domain(); below. */
#include <assert.h>
/* Override any gcc2 internal prototype to avoid an error. */
/* We use char because int might match the return type of a gcc2
builtin and then its argument prototype would still apply. */
char yp_get_default_domain();
int main() {
/* The GNU C library defines this for functions which it implements
to always fail with ENOSYS. Some functions are actually named
something starting with __ and the normal name is an alias. */
#if defined (__stub_yp_get_default_domain) || defined
(__stub___yp_get_default_domain)
choke me
#else
yp_get_default_domain();
#endif
; return 0; }
configure:11178: checking for __yp_get_default_domain
configure:11206: gcc -o conftest -g -O2 conftest.c 1>&5
/tmp/ccsAzCpJ.o(.text+0xa): In function `main':
/software/php-4.3.9/configure:11200: undefined reference to
`__yp_get_default_domain'
collect2: ld returned 1 exit status
configure: failed program was:
#line 11183 "configure"
#include "confdefs.h"
/* System header to define __stub macros and hopefully few prototypes,
which can conflict with char __yp_get_default_domain(); below. */
#include <assert.h>
/* Override any gcc2 internal prototype to avoid an error. */
/* We use char because int might match the return type of a gcc2
builtin and then its argument prototype would still apply. */
char __yp_get_default_domain();
int main() {
/* The GNU C library defines this for functions which it implements
to always fail with ENOSYS. Some functions are actually named
something starting with __ and the normal name is an alias. */
#if defined (__stub___yp_get_default_domain) || defined
(__stub_____yp_get_default_domain)
choke me
#else
__yp_get_default_domain();
#endif
; return 0; }
configure:11244: checking for yp_get_default_domain in -lnsl
configure:11263: gcc -o conftest -g -O2 conftest.c -lnsl 1>&5
configure:11338: gcc -o conftest -g -O2 conftest.c -lnsl 1>&5
configure:11390: checking for dlopen
configure:11418: gcc -o conftest -g -O2 conftest.c -lnsl 1>&5
/tmp/ccs1TRuy.o(.text+0xa): In function `main':
/software/php-4.3.9/configure:11412: undefined reference to `dlopen'
collect2: ld returned 1 exit status
configure: failed program was:
#line 11395 "configure"
#include "confdefs.h"
/* System header to define __stub macros and hopefully few prototypes,
which can conflict with char dlopen(); below. */
#include <assert.h>
/* Override any gcc2 internal prototype to avoid an error. */
/* We use char because int might match the return type of a gcc2
builtin and then its argument prototype would still apply. */
char dlopen();
int main() {
/* The GNU C library defines this for functions which it implements
to always fail with ENOSYS. Some functions are actually named
something starting with __ and the normal name is an alias. */
#if defined (__stub_dlopen) || defined (__stub___dlopen)
choke me
#else
dlopen();
#endif
; return 0; }
configure:11436: checking for __dlopen
configure:11464: gcc -o conftest -g -O2 conftest.c -lnsl 1>&5
/tmp/cc4bqNWN.o(.text+0xa): In function `main':
/software/php-4.3.9/configure:11458: undefined reference to `__dlopen'
collect2: ld returned 1 exit status
configure: failed program was:
#line 11441 "configure"
#include "confdefs.h"
/* System header to define __stub macros and hopefully few prototypes,
which can conflict with char __dlopen(); below. */
#include <assert.h>
/* Override any gcc2 internal prototype to avoid an error. */
/* We use char because int might match the return type of a gcc2
builtin and then its argument prototype would still apply. */
char __dlopen();
int main() {
/* The GNU C library defines this for functions which it implements
to always fail with ENOSYS. Some functions are actually named
something starting with __ and the normal name is an alias. */
#if defined (__stub___dlopen) || defined (__stub_____dlopen)
choke me
#else
__dlopen();
#endif
; return 0; }
configure:11502: checking for dlopen in -ldl
configure:11521: gcc -o conftest -g -O2 conftest.c -ldl -lnsl 1>&5
configure:11596: gcc -o conftest -g -O2 conftest.c -lnsl -ldl 1>&5
configure:11648: checking for sin in -lm
configure:11667: gcc -o conftest -g -O2 conftest.c -lm -ldl -lnsl 1>&5
configure:11660: warning: conflicting types for built-in function `sin'
configure:11701: checking for res_search
configure:11729: gcc -o conftest -g -O2 conftest.c -lm -ldl -lnsl 1>&5
/tmp/ccmdUC4E.o(.text+0xa): In function `main':
/software/php-4.3.9/configure:11723: undefined reference to `res_search'
collect2: ld returned 1 exit status
configure: failed program was:
#line 11706 "configure"
#include "confdefs.h"
/* System header to define __stub macros and hopefully few prototypes,
which can conflict with char res_search(); below. */
#include <assert.h>
/* Override any gcc2 internal prototype to avoid an error. */
/* We use char because int might match the return type of a gcc2
builtin and then its argument prototype would still apply. */
char res_search();
int main() {
/* The GNU C library defines this for functions which it implements
to always fail with ENOSYS. Some functions are actually named
something starting with __ and the normal name is an alias. */
#if defined (__stub_res_search) || defined (__stub___res_search)
choke me
#else
res_search();
#endif
; return 0; }
configure:11747: checking for __res_search
configure:11775: gcc -o conftest -g -O2 conftest.c -lm -ldl -lnsl 1>&5
/tmp/ccEbQEiX.o(.text+0xa): In function `main':
/software/php-4.3.9/configure:11769: undefined reference to `__res_search'
collect2: ld returned 1 exit status
configure: failed program was:
#line 11752 "configure"
#include "confdefs.h"
/* System header to define __stub macros and hopefully few prototypes,
which can conflict with char __res_search(); below. */
#include <assert.h>
/* Override any gcc2 internal prototype to avoid an error. */
/* We use char because int might match the return type of a gcc2
builtin and then its argument prototype would still apply. */
char __res_search();
int main() {
/* The GNU C library defines this for functions which it implements
to always fail with ENOSYS. Some functions are actually named
something starting with __ and the normal name is an alias. */
#if defined (__stub___res_search) || defined (__stub_____res_search)
choke me
#else
__res_search();
#endif
; return 0; }
configure:11813: checking for res_search in -lresolv
configure:11832: gcc -o conftest -g -O2 conftest.c -lresolv -lm -ldl
-lnsl 1>&5
configure:11907: gcc -o conftest -g -O2 conftest.c -lm -ldl -lnsl
-lresolv 1>&5
configure:12237: checking for inet_aton
configure:12265: gcc -o conftest -g -O2 conftest.c -lresolv -lm -ldl
-lnsl 1>&5
configure:12633: checking for dn_skipname
configure:12661: gcc -o conftest -g -O2 conftest.c -lresolv -lm -ldl
-lnsl 1>&5
/tmp/ccOMXcb8.o(.text+0xa): In function `main':
/software/php-4.3.9/configure:12655: undefined reference to `dn_skipname'
collect2: ld returned 1 exit status
configure: failed program was:
#line 12638 "configure"
#include "confdefs.h"
/* System header to define __stub macros and hopefully few prototypes,
which can conflict with char dn_skipname(); below. */
#include <assert.h>
/* Override any gcc2 internal prototype to avoid an error. */
/* We use char because int might match the return type of a gcc2
builtin and then its argument prototype would still apply. */
char dn_skipname();
int main() {
/* The GNU C library defines this for functions which it implements
to always fail with ENOSYS. Some functions are actually named
something starting with __ and the normal name is an alias. */
#if defined (__stub_dn_skipname) || defined (__stub___dn_skipname)
choke me
#else
dn_skipname();
#endif
; return 0; }
configure:12679: checking for __dn_skipname
configure:12707: gcc -o conftest -g -O2 conftest.c -lresolv -lm -ldl
-lnsl 1>&5
configure:13027: checking for ANSI C header files
configure:13040: gcc -E conftest.c >/dev/null 2>conftest.out
configure:13107: gcc -o conftest -g -O2 conftest.c -lresolv -lm -ldl
-lnsl 1>&5
configure:13135: checking for dirent.h that defines DIR
configure:13148: gcc -c -g -O2 conftest.c 1>&5
configure:13173: checking for opendir in -ldir
configure:13192: gcc -o conftest -g -O2 conftest.c -ldir -lresolv -lm
-ldl -lnsl
1>&5
/usr/bin/ld: cannot find -ldir
collect2: ld returned 1 exit status
configure: failed program was:
#line 13181 "configure"
#include "confdefs.h"
/* Override any gcc2 internal prototype to avoid an error. */
/* We use char because int might match the return type of a gcc2
builtin and then its argument prototype would still apply. */
char opendir();
int main() {
opendir()
; return 0; }
configure:13258: checking for fclose declaration
configure:13267: gcc -c -g -O2 conftest.c 1>&5
configure:13342: checking for dirent.h
configure:13352: gcc -E conftest.c >/dev/null 2>conftest.out
configure:13342: checking for ApplicationServices/ApplicationServices.h
configure:13352: gcc -E conftest.c >/dev/null 2>conftest.out
configure:13348:53: ApplicationServices/ApplicationServices.h: No such
file or
directory
configure: failed program was:
#line 13347 "configure"
#include "confdefs.h"
#include <ApplicationServices/ApplicationServices.h>
configure:13342: checking for sys/param.h
configure:13352: gcc -E conftest.c >/dev/null 2>conftest.out
configure:13342: checking for sys/types.h
configure:13352: gcc -E conftest.c >/dev/null 2>conftest.out
configure:13342: checking for sys/time.h
configure:13352: gcc -E conftest.c >/dev/null 2>conftest.out
configure:13342: checking for netinet/in.h
configure:13352: gcc -E conftest.c >/dev/null 2>conftest.out
configure:13342: checking for alloca.h
configure:13352: gcc -E conftest.c >/dev/null 2>conftest.out
configure:13342: checking for arpa/inet.h
configure:13352: gcc -E conftest.c >/dev/null 2>conftest.out
configure:13342: checking for arpa/nameser.h
configure:13352: gcc -E conftest.c >/dev/null 2>conftest.out
configure:13342: checking for assert.h
configure:13352: gcc -E conftest.c >/dev/null 2>conftest.out
configure:13342: checking for crypt.h
configure:13352: gcc -E conftest.c >/dev/null 2>conftest.out
configure:13342: checking for fcntl.h
configure:13352: gcc -E conftest.c >/dev/null 2>conftest.out
configure:13342: checking for grp.h
configure:13352: gcc -E conftest.c >/dev/null 2>conftest.out
configure:13342: checking for ieeefp.h
configure:13352: gcc -E conftest.c >/dev/null 2>conftest.out
configure:13348:20: ieeefp.h: No such file or directory
configure: failed program was:
#line 13347 "configure"
#include "confdefs.h"
#include <ieeefp.h>
configure:13342: checking for langinfo.h
configure:13352: gcc -E conftest.c >/dev/null 2>conftest.out
configure:13342: checking for limits.h
configure:13352: gcc -E conftest.c >/dev/null 2>conftest.out
configure:13342: checking for locale.h
configure:13352: gcc -E conftest.c >/dev/null 2>conftest.out
configure:13342: checking for monetary.h
configure:13352: gcc -E conftest.c >/dev/null 2>conftest.out
configure:13342: checking for mach-o/dyld.h
configure:13352: gcc -E conftest.c >/dev/null 2>conftest.out
configure:13348:25: mach-o/dyld.h: No such file or directory
configure: failed program was:
#line 13347 "configure"
#include "confdefs.h"
#include <mach-o/dyld.h>
configure:13342: checking for netdb.h
configure:13352: gcc -E conftest.c >/dev/null 2>conftest.out
configure:13342: checking for pwd.h
configure:13352: gcc -E conftest.c >/dev/null 2>conftest.out
configure:13342: checking for resolv.h
configure:13352: gcc -E conftest.c >/dev/null 2>conftest.out
configure:13342: checking for signal.h
configure:13352: gcc -E conftest.c >/dev/null 2>conftest.out
configure:13342: checking for stdarg.h
configure:13352: gcc -E conftest.c >/dev/null 2>conftest.out
configure:13342: checking for stdlib.h
configure:13352: gcc -E conftest.c >/dev/null 2>conftest.out
configure:13342: checking for string.h
configure:13352: gcc -E conftest.c >/dev/null 2>conftest.out
configure:13342: checking for syslog.h
configure:13352: gcc -E conftest.c >/dev/null 2>conftest.out
configure:13342: checking for sysexits.h
configure:13352: gcc -E conftest.c >/dev/null 2>conftest.out
configure:13342: checking for sys/file.h
configure:13352: gcc -E conftest.c >/dev/null 2>conftest.out
configure:13342: checking for sys/mman.h
configure:13352: gcc -E conftest.c >/dev/null 2>conftest.out
configure:13342: checking for sys/mount.h
configure:13352: gcc -E conftest.c >/dev/null 2>conftest.out
configure:13342: checking for sys/poll.h
configure:13352: gcc -E conftest.c >/dev/null 2>conftest.out
configure:13342: checking for sys/resource.h
configure:13352: gcc -E conftest.c >/dev/null 2>conftest.out
configure:13342: checking for sys/select.h
configure:13352: gcc -E conftest.c >/dev/null 2>conftest.out
configure:13342: checking for sys/socket.h
configure:13352: gcc -E conftest.c >/dev/null 2>conftest.out
configure:13342: checking for sys/statfs.h
configure:13352: gcc -E conftest.c >/dev/null 2>conftest.out
configure:13342: checking for sys/statvfs.h
configure:13352: gcc -E conftest.c >/dev/null 2>conftest.out
configure:13342: checking for sys/vfs.h
configure:13352: gcc -E conftest.c >/dev/null 2>conftest.out
configure:13342: checking for sys/sysexits.h
configure:13352: gcc -E conftest.c >/dev/null 2>conftest.out
configure:13348:26: sys/sysexits.h: No such file or directory
configure: failed program was:
#line 13347 "configure"
#include "confdefs.h"
#include <sys/sysexits.h>
configure:13342: checking for sys/varargs.h
configure:13352: gcc -E conftest.c >/dev/null 2>conftest.out
configure:13348:25: sys/varargs.h: No such file or directory
configure: failed program was:
#line 13347 "configure"
#include "confdefs.h"
#include <sys/varargs.h>
configure:13342: checking for sys/wait.h
configure:13352: gcc -E conftest.c >/dev/null 2>conftest.out
configure:13342: checking for unistd.h
configure:13352: gcc -E conftest.c >/dev/null 2>conftest.out
configure:13342: checking for unix.h
configure:13352: gcc -E conftest.c >/dev/null 2>conftest.out
configure:13348:18: unix.h: No such file or directory
configure: failed program was:
#line 13347 "configure"
#include "confdefs.h"
#include <unix.h>
configure:13342: checking for utime.h
configure:13352: gcc -E conftest.c >/dev/null 2>conftest.out
configure:13342: checking for sys/utsname.h
configure:13352: gcc -E conftest.c >/dev/null 2>conftest.out
configure:13342: checking for sys/ipc.h
configure:13352: gcc -E conftest.c >/dev/null 2>conftest.out
configure:13342: checking for dlfcn.h
configure:13352: gcc -E conftest.c >/dev/null 2>conftest.out
configure:13381: checking for fopencookie
configure:13409: gcc -o conftest -g -O2 conftest.c -lresolv -lm -ldl
-lnsl 1>&5
configure:13440: gcc -c -g -O2 conftest.c 1>&5
configure:13492: gcc -o conftest -g -O2 conftest.c -lresolv -lm -ldl
-lnsl 1>&5
configure:13553: checking for broken getcwd
configure:13568: checking for broken libc stdio
configure:13629: gcc -o conftest -g -O2 conftest.c -lresolv -lm -ldl
-lnsl 1>&5
configure: failed program was:
#line 13601 "configure"
#include "confdefs.h"
#include <stdio.h>
int main(int argc, char *argv[])
{
FILE *fp;
long position;
char *filename = "/tmp/phpglibccheck";
fp = fopen(filename, "w");
if (fp == NULL) {
perror("fopen");
exit(2);
}
fputs("foobar", fp);
fclose(fp);
fp = fopen(filename, "a+");
position = ftell(fp);
fclose(fp);
unlink(filename);
if (position == 0)
return 1;
return 0;
}
configure:13657: checking whether struct tm is in sys/time.h or time.h
configure:13670: gcc -c -g -O2 conftest.c 1>&5
configure:13691: checking for tm_zone in struct tm
configure:13704: gcc -c -g -O2 conftest.c 1>&5
configure:13763: checking for tm_gmtoff in struct tm
configure:13776: gcc -c -g -O2 conftest.c 1>&5
configure:13799: checking for struct flock
configure:13814: gcc -c -g -O2 conftest.c 1>&5
configure:13841: checking for socklen_t
configure:13858: gcc -c -g -O2 conftest.c 1>&5
configure:13884: checking size of long
configure:13903: gcc -o conftest -g -O2 conftest.c -lresolv -lm -ldl
-lnsl 1>&5
configure:13923: checking size of int
configure:13942: gcc -o conftest -g -O2 conftest.c -lresolv -lm -ldl
-lnsl 1>&5
configure:13963: checking for st_blksize in struct stat
configure:13976: gcc -c -g -O2 conftest.c 1>&5
configure:13998: checking for st_blocks in struct stat
configure:14011: gcc -c -g -O2 conftest.c 1>&5
configure:14038: checking for st_rdev in struct stat
configure:14051: gcc -c -g -O2 conftest.c 1>&5
configure:14073: checking for size_t
configure:14106: checking for uid_t in sys/types.h
configure:14141: checking for struct sockaddr_storage
configure:14154: gcc -c -g -O2 conftest.c 1>&5
configure:14186: gcc -c -g -O2 conftest.c 1>&5
configure: In function `main':
configure:14182: error: structure has no member named `sa_len'
configure: failed program was:
#line 14176 "configure"
#include "confdefs.h"
#include <sys/types.h>
#include <sys/socket.h>
int main() {
static struct sockaddr sa; int n = (int) sa.sa_len; return n
; return 0; }
configure:14199: checking for IPv6 support
configure:14213: gcc -o conftest -g -O2 conftest.c -lresolv -lm -ldl
-lnsl 1>&5
configure:14231: checking for vprintf
configure:14259: gcc -o conftest -g -O2 conftest.c -lresolv -lm -ldl
-lnsl 1>&5
configure:14243: warning: conflicting types for built-in function `vprintf'
configure:14403: checking for alphasort
configure:14431: gcc -o conftest -g -O2 conftest.c -lresolv -lm -ldl
-lnsl 1>&5
configure:14403: checking for asctime_r
configure:14431: gcc -o conftest -g -O2 conftest.c -lresolv -lm -ldl
-lnsl 1>&5
configure:14403: checking for chroot
configure:14431: gcc -o conftest -g -O2 conftest.c -lresolv -lm -ldl
-lnsl 1>&5
configure:14403: checking for ctime_r
configure:14431: gcc -o conftest -g -O2 conftest.c -lresolv -lm -ldl
-lnsl 1>&5
configure:14403: checking for cuserid
configure:14431: gcc -o conftest -g -O2 conftest.c -lresolv -lm -ldl
-lnsl 1>&5
configure:14403: checking for crypt
configure:14431: gcc -o conftest -g -O2 conftest.c -lresolv -lm -ldl
-lnsl 1>&5
/tmp/ccoDuBiY.o(.text+0xa): In function `main':
/software/php-4.3.9/configure:14425: undefined reference to `crypt'
collect2: ld returned 1 exit status
configure: failed program was:
#line 14408 "configure"
#include "confdefs.h"
/* System header to define __stub macros and hopefully few prototypes,
which can conflict with char crypt(); below. */
#include <assert.h>
/* Override any gcc2 internal prototype to avoid an error. */
/* We use char because int might match the return type of a gcc2
builtin and then its argument prototype would still apply. */
char crypt();
int main() {
/* The GNU C library defines this for functions which it implements
to always fail with ENOSYS. Some functions are actually named
something starting with __ and the normal name is an alias. */
#if defined (__stub_crypt) || defined (__stub___crypt)
choke me
#else
crypt();
#endif
; return 0; }
configure:14403: checking for flock
configure:14431: gcc -o conftest -g -O2 conftest.c -lresolv -lm -ldl
-lnsl 1>&5
configure:14403: checking for ftok
configure:14431: gcc -o conftest -g -O2 conftest.c -lresolv -lm -ldl
-lnsl 1>&5
configure:14403: checking for funopen
configure:14431: gcc -o conftest -g -O2 conftest.c -lresolv -lm -ldl
-lnsl 1>&5
/tmp/ccE216HV.o(.text+0xa): In function `main':
/software/php-4.3.9/configure:14425: undefined reference to `funopen'
collect2: ld returned 1 exit status
configure: failed program was:
#line 14408 "configure"
#include "confdefs.h"
/* System header to define __stub macros and hopefully few prototypes,
which can conflict with char funopen(); below. */
#include <assert.h>
/* Override any gcc2 internal prototype to avoid an error. */
/* We use char because int might match the return type of a gcc2
builtin and then its argument prototype would still apply. */
char funopen();
int main() {
/* The GNU C library defines this for functions which it implements
to always fail with ENOSYS. Some functions are actually named
something starting with __ and the normal name is an alias. */
#if defined (__stub_funopen) || defined (__stub___funopen)
choke me
#else
funopen();
#endif
; return 0; }
configure:14403: checking for gai_strerror
configure:14431: gcc -o conftest -g -O2 conftest.c -lresolv -lm -ldl
-lnsl 1>&5
configure:14403: checking for gcvt
configure:14431: gcc -o conftest -g -O2 conftest.c -lresolv -lm -ldl
-lnsl 1>&5
configure:14403: checking for getlogin
configure:14431: gcc -o conftest -g -O2 conftest.c -lresolv -lm -ldl
-lnsl 1>&5
configure:14403: checking for getprotobyname
configure:14431: gcc -o conftest -g -O2 conftest.c -lresolv -lm -ldl
-lnsl 1>&5
configure:14403: checking for getprotobynumber
configure:14431: gcc -o conftest -g -O2 conftest.c -lresolv -lm -ldl
-lnsl 1>&5
configure:14403: checking for getservbyname
configure:14431: gcc -o conftest -g -O2 conftest.c -lresolv -lm -ldl
-lnsl 1>&5
configure:14403: checking for getservbyport
configure:14431: gcc -o conftest -g -O2 conftest.c -lresolv -lm -ldl
-lnsl 1>&5
configure:14403: checking for getrusage
configure:14431: gcc -o conftest -g -O2 conftest.c -lresolv -lm -ldl
-lnsl 1>&5
configure:14403: checking for gettimeofday
configure:14431: gcc -o conftest -g -O2 conftest.c -lresolv -lm -ldl
-lnsl 1>&5
configure:14403: checking for gmtime_r
configure:14431: gcc -o conftest -g -O2 conftest.c -lresolv -lm -ldl
-lnsl 1>&5
configure:14403: checking for isascii
configure:14431: gcc -o conftest -g -O2 conftest.c -lresolv -lm -ldl
-lnsl 1>&5
configure:14403: checking for link
configure:14431: gcc -o conftest -g -O2 conftest.c -lresolv -lm -ldl
-lnsl 1>&5
configure:14403: checking for localtime_r
configure:14431: gcc -o conftest -g -O2 conftest.c -lresolv -lm -ldl
-lnsl 1>&5
configure:14403: checking for lockf
configure:14431: gcc -o conftest -g -O2 conftest.c -lresolv -lm -ldl
-lnsl 1>&5
configure:14403: checking for lrand48
configure:14431: gcc -o conftest -g -O2 conftest.c -lresolv -lm -ldl
-lnsl 1>&5
configure:14403: checking for memcpy
configure:14431: gcc -o conftest -g -O2 conftest.c -lresolv -lm -ldl
-lnsl 1>&5
configure:14415: warning: conflicting types for built-in function `memcpy'
configure:14403: checking for memmove
configure:14431: gcc -o conftest -g -O2 conftest.c -lresolv -lm -ldl
-lnsl 1>&5
configure:14415: warning: conflicting types for built-in function `memmove'
configure:14403: checking for mkstemp
configure:14431: gcc -o conftest -g -O2 conftest.c -lresolv -lm -ldl
-lnsl 1>&5
configure:14403: checking for mmap
configure:14431: gcc -o conftest -g -O2 conftest.c -lresolv -lm -ldl
-lnsl 1>&5
configure:14403: checking for nl_langinfo
configure:14431: gcc -o conftest -g -O2 conftest.c -lresolv -lm -ldl
-lnsl 1>&5
configure:14403: checking for perror
configure:14431: gcc -o conftest -g -O2 conftest.c -lresolv -lm -ldl
-lnsl 1>&5
configure:14403: checking for poll
configure:14431: gcc -o conftest -g -O2 conftest.c -lresolv -lm -ldl
-lnsl 1>&5
configure:14403: checking for putenv
configure:14431: gcc -o conftest -g -O2 conftest.c -lresolv -lm -ldl
-lnsl 1>&5
configure:14403: checking for realpath
configure:14431: gcc -o conftest -g -O2 conftest.c -lresolv -lm -ldl
-lnsl 1>&5
configure:14403: checking for random
configure:14431: gcc -o conftest -g -O2 conftest.c -lresolv -lm -ldl
-lnsl 1>&5
configure:14403: checking for rand_r
configure:14431: gcc -o conftest -g -O2 conftest.c -lresolv -lm -ldl
-lnsl 1>&5
configure:14403: checking for regcomp
configure:14431: gcc -o conftest -g -O2 conftest.c -lresolv -lm -ldl
-lnsl 1>&5
configure:14403: checking for res_search
configure:14403: checking for scandir
configure:14431: gcc -o conftest -g -O2 conftest.c -lresolv -lm -ldl
-lnsl 1>&5
configure:14403: checking for setitimer
configure:14431: gcc -o conftest -g -O2 conftest.c -lresolv -lm -ldl
-lnsl 1>&5
configure:14403: checking for setlocale
configure:14431: gcc -o conftest -g -O2 conftest.c -lresolv -lm -ldl
-lnsl 1>&5
configure:14403: checking for localeconv
configure:14431: gcc -o conftest -g -O2 conftest.c -lresolv -lm -ldl
-lnsl 1>&5
configure:14403: checking for setsockopt
configure:14431: gcc -o conftest -g -O2 conftest.c -lresolv -lm -ldl
-lnsl 1>&5
configure:14403: checking for setvbuf
configure:14431: gcc -o conftest -g -O2 conftest.c -lresolv -lm -ldl
-lnsl 1>&5
configure:14403: checking for shutdown
configure:14431: gcc -o conftest -g -O2 conftest.c -lresolv -lm -ldl
-lnsl 1>&5
configure:14403: checking for sin
configure:14431: gcc -o conftest -g -O2 conftest.c -lresolv -lm -ldl
-lnsl 1>&5
configure:14415: warning: conflicting types for built-in function `sin'
configure:14403: checking for snprintf
configure:14431: gcc -o conftest -g -O2 conftest.c -lresolv -lm -ldl
-lnsl 1>&5
configure:14415: warning: conflicting types for built-in function `snprintf'
configure:14403: checking for srand48
configure:14431: gcc -o conftest -g -O2 conftest.c -lresolv -lm -ldl
-lnsl 1>&5
configure:14403: checking for srandom
configure:14431: gcc -o conftest -g -O2 conftest.c -lresolv -lm -ldl
-lnsl 1>&5
configure:14403: checking for statfs
configure:14431: gcc -o conftest -g -O2 conftest.c -lresolv -lm -ldl
-lnsl 1>&5
configure:14403: checking for statvfs
configure:14431: gcc -o conftest -g -O2 conftest.c -lresolv -lm -ldl
-lnsl 1>&5
configure:14403: checking for std_syslog
configure:14431: gcc -o conftest -g -O2 conftest.c -lresolv -lm -ldl
-lnsl 1>&5
/tmp/ccc2F7ui.o(.text+0xa): In function `main':
/software/php-4.3.9/configure:14425: undefined reference to `std_syslog'
collect2: ld returned 1 exit status
configure: failed program was:
#line 14408 "configure"
#include "confdefs.h"
/* System header to define __stub macros and hopefully few prototypes,
which can conflict with char std_syslog(); below. */
#include <assert.h>
/* Override any gcc2 internal prototype to avoid an error. */
/* We use char because int might match the return type of a gcc2
builtin and then its argument prototype would still apply. */
char std_syslog();
int main() {
/* The GNU C library defines this for functions which it implements
to always fail with ENOSYS. Some functions are actually named
something starting with __ and the normal name is an alias. */
#if defined (__stub_std_syslog) || defined (__stub___std_syslog)
choke me
#else
std_syslog();
#endif
; return 0; }
configure:14403: checking for strcasecmp
configure:14431: gcc -o conftest -g -O2 conftest.c -lresolv -lm -ldl
-lnsl 1>&5
configure:14403: checking for strcoll
configure:14431: gcc -o conftest -g -O2 conftest.c -lresolv -lm -ldl
-lnsl 1>&5
configure:14403: checking for strdup
configure:14431: gcc -o conftest -g -O2 conftest.c -lresolv -lm -ldl
-lnsl 1>&5
configure:14403: checking for strerror
configure:14431: gcc -o conftest -g -O2 conftest.c -lresolv -lm -ldl
-lnsl 1>&5
configure:14403: checking for strftime
configure:14431: gcc -o conftest -g -O2 conftest.c -lresolv -lm -ldl
-lnsl 1>&5
configure:14403: checking for strstr
configure:14431: gcc -o conftest -g -O2 conftest.c -lresolv -lm -ldl
-lnsl 1>&5
configure:14415: warning: conflicting types for built-in function `strstr'
configure:14403: checking for strtok_r
configure:14431: gcc -o conftest -g -O2 conftest.c -lresolv -lm -ldl
-lnsl 1>&5
configure:14403: checking for symlink
configure:14431: gcc -o conftest -g -O2 conftest.c -lresolv -lm -ldl
-lnsl 1>&5
configure:14403: checking for tempnam
configure:14431: gcc -o conftest -g -O2 conftest.c -lresolv -lm -ldl
-lnsl 1>&5
/tmp/ccwPGeCg.o(.text+0xa): In function `main':
/software/php-4.3.9/configure:14425: warning: the use of `tempnam' is
dangerous,
better use `mkstemp'
configure:14403: checking for tzset
configure:14431: gcc -o conftest -g -O2 conftest.c -lresolv -lm -ldl
-lnsl 1>&5
configure:14403: checking for unsetenv
configure:14431: gcc -o conftest -g -O2 conftest.c -lresolv -lm -ldl
-lnsl 1>&5
configure:14403: checking for usleep
configure:14431: gcc -o conftest -g -O2 conftest.c -lresolv -lm -ldl
-lnsl 1>&5
configure:14403: checking for utime
configure:14431: gcc -o conftest -g -O2 conftest.c -lresolv -lm -ldl
-lnsl 1>&5
configure:14403: checking for vsnprintf
configure:14431: gcc -o conftest -g -O2 conftest.c -lresolv -lm -ldl
-lnsl 1>&5
configure:14415: warning: conflicting types for built-in function `vsnprintf'
configure:14457: checking for getaddrinfo
configure:14469: gcc -o conftest -g -O2 conftest.c -lresolv -lm -ldl
-lnsl 1>&5
configure:14512: gcc -o conftest -g -O2 conftest.c -lresolv -lm -ldl
-lnsl 1>&5
configure:14544: checking for strlcat
configure:14572: gcc -o conftest -g -O2 conftest.c -lresolv -lm -ldl
-lnsl 1>&5
/tmp/cc0Axwqp.o(.text+0xa): In function `main':
/software/php-4.3.9/configure:14566: undefined reference to `strlcat'
collect2: ld returned 1 exit status
configure: failed program was:
#line 14549 "configure"
#include "confdefs.h"
/* System header to define __stub macros and hopefully few prototypes,
which can conflict with char strlcat(); below. */
#include <assert.h>
/* Override any gcc2 internal prototype to avoid an error. */
/* We use char because int might match the return type of a gcc2
builtin and then its argument prototype would still apply. */
char strlcat();
int main() {
/* The GNU C library defines this for functions which it implements
to always fail with ENOSYS. Some functions are actually named
something starting with __ and the normal name is an alias. */
#if defined (__stub_strlcat) || defined (__stub___strlcat)
choke me
#else
strlcat();
#endif
; return 0; }
configure:14544: checking for strlcpy
configure:14572: gcc -o conftest -g -O2 conftest.c -lresolv -lm -ldl
-lnsl 1>&5
/tmp/ccKXLoMB.o(.text+0xa): In function `main':
/software/php-4.3.9/configure:14566: undefined reference to `strlcpy'
collect2: ld returned 1 exit status
configure: failed program was:
#line 14549 "configure"
#include "confdefs.h"
/* System header to define __stub macros and hopefully few prototypes,
which can conflict with char strlcpy(); below. */
#include <assert.h>
/* Override any gcc2 internal prototype to avoid an error. */
/* We use char because int might match the return type of a gcc2
builtin and then its argument prototype would still apply. */
char strlcpy();
int main() {
/* The GNU C library defines this for functions which it implements
to always fail with ENOSYS. Some functions are actually named
something starting with __ and the normal name is an alias. */
#if defined (__stub_strlcpy) || defined (__stub___strlcpy)
choke me
#else
strlcpy();
#endif
; return 0; }
configure:14544: checking for getopt
configure:14572: gcc -o conftest -g -O2 conftest.c -lresolv -lm -ldl
-lnsl 1>&5
configure:14599: checking whether utime accepts a null argument
configure:14620: gcc -o conftest -g -O2 conftest.c -lresolv -lm -ldl
-lnsl 1>&5
configure:14646: checking for working alloca.h
configure:14679: checking for alloca
configure:14712: gcc -o conftest -g -O2 conftest.c -lresolv -lm -ldl
-lnsl 1>&5
configure:14879: checking whether sprintf is broken
configure:14894: gcc -o conftest -g -O2 conftest.c -lresolv -lm -ldl
-lnsl 1>&5
configure:14928: checking whether snprintf is broken
configure:14958: gcc -o conftest -g -O2 conftest.c -lresolv -lm -ldl
-lnsl 1>&5
configure:14992: checking for declared timezone
configure:15013: gcc -c -g -O2 conftest.c 1>&5
configure:15039: checking for type of reentrant time-related functions
configure:15068: gcc -o conftest -g -O2 conftest.c -lresolv -lm -ldl
-lnsl 1>&5
configure: In function `main':
configure:15060: warning: assignment makes integer from pointer without a
cast
configure:15061: error: too many arguments to function `asctime_r'
configure: failed program was:
#line 15050 "configure"
#include "confdefs.h"
#include <time.h>
main() {
char buf[27];
struct tm t;
time_t old = 0;
int r, s;
s = gmtime_r(&old, &t);
r = (int) asctime_r(&t, buf, 26);
if (r == s && s == 0) return (0);
return (1);
}
configure:15098: gcc -o conftest -g -O2 conftest.c -lresolv -lm -ldl
-lnsl 1>&5
configure: In function `main':
configure:15091: error: too many arguments to function `asctime_r'
configure: failed program was:
#line 15082 "configure"
#include "confdefs.h"
#include <time.h>
main() {
struct tm t, *s;
time_t old = 0;
char buf[27], *p;
s = gmtime_r(&old, &t);
p = asctime_r(&t, buf, 26);
if (p == buf && s == &t) return (0);
return (1);
}
configure:15136: checking for readdir_r
configure:15164: gcc -o conftest -g -O2 conftest.c -lresolv -lm -ldl
-lnsl 1>&5
configure:15186: checking for type of readdir_r
configure:15222: gcc -o conftest -g -O2 conftest.c -lresolv -lm -ldl
-lnsl 1>&5
configure:15340: checking whether to include debugging symbols
configure:15373: checking layout of installed files
configure:15407: checking path to configuration file
configure:15443: checking directory to be scanned for configuration files
configure:15473: checking whether to enable safe mode by default
configure:15508: checking for safe mode exec dir
configure:15549: checking whether to enable PHP's own SIGCHLD handler
configure:15586: checking whether to enable magic quotes by default
configure:15623: checking whether to enable runpaths
configure:15648: checking whether to explicitly link against libgcc
configure:15727: checking whether to enable short tags by default
configure:15764: checking whether to enable dmalloc
configure:15852: checking whether to enable IPv6 support
configure:15882: checking whether to enable versioning
configure:15934: checking for OpenSSL support
configure:16832: checking for ZLIB support
configure:16878: checking if the location of ZLIB install directory is
defined
configure:17376: checking whether to enable bc style precision math functions
configure:17658: checking for BZip2 support
configure:18204: checking whether to enable calendar conversion support
configure:18469: checking for cpdflib support
configure:19506: checking for CRACKlib support
configure:19917: checking whether to enable ctype functions
configure:20180: checking for CURL support
configure:20959: checking for cyrus imap support
configure:21872: checking for xDBM support
configure:22491: checking whether to enable DBA
configure:22817: checking for GDBM support
configure:23122: checking for NDBM support
configure:23421: checking for Berkeley DB4 support
configure:23741: checking for Berkeley DB3 support
configure:24061: checking for Berkeley DB2 support
configure:24381: checking for DBM support
configure:24722: checking for CDB support
configure:24776: checking for INI File support
configure:24830: checking for FlatFile support
configure:24845: checking whether to enable DBA interface
configure:25088: checking whether to enable dbase support
configure:25351: checking whether to enable dbx support
configure:25610: checking whether to enable direct I/O support
configure:25871: checking for DOM support
configure:26532: checking for DOM XSLT support
configure:26557: checking for DOM EXSLT support
configure:27200: checking whether to enable EXIF (metadata from images)
support
configure:27463: checking for FrontBase SQL92 (fbsql) support
configure:27885: checking for FDF support
configure:28597: checking whether to enable the bundled filePro support
configure:28860: checking for FriBidi support
configure:29303: checking whether to enable FTP support
configure:29567: checking for GD support
configure:29614: checking for the location of libjpeg
configure:29641: checking for the location of libpng
configure:29694: checking for the location of libXpm
configure:29719: checking for FreeType 1.x support
configure:29744: checking for FreeType 2
configure:29769: checking for T1lib support
configure:29794: checking whether to enable truetype string function in GD
configure:29819: checking whether to enable JIS-mapped Japanese font
support in GD
configure:36827: checking for GNU gettext support
configure:37503: checking for GNU MP support
configure:38170: checking for hwapi support
configure:38832: checking for Hyperwave support
configure:39075: checking for iconv support
configure:40137: checking for IMAP support
configure:40586: checking for pam_start in -lpam
configure:40605: gcc -o conftest -g -O2 conftest.c -lpam -lresolv -lm
-ldl -lnsl
1>&5
configure:40743: checking for crypt in -lcrypt
configure:40762: gcc -o conftest -g -O2 conftest.c -lcrypt -lpam
-lresolv -lm
-ldl -lnsl 1>&5
configure:41193: checking whether SSL libraries are needed for c-client
configure:41323: gcc -o conftest -g -O2 conftest.c -lc-client -lcrypt
-lpam
-lresolv -lm -ldl -lnsl -lgssapi_krb5 -lkrb5 -lk5crypto -lcom_err 1>&5
/usr/lib/gcc-lib/i386-redhat-linux/3.3.2/../../../libc-client.a(osdep.o)(.text+0xabf7):
In function `ssl_onceonlyinit':
: warning: the use of
tmpnam' is dangerous, better use mkstemp'
/usr/lib/gcc-lib/i386-redhat-linux/3.3.2/../../../libc-client.a(osdep.o)(.text+0xabe7):
In function `ssl_onceonlyinit':
: undefined reference to `SSL_library_init'
/usr/lib/gcc-lib/i386-redhat-linux/3.3.2/../../../libc-client.a(osdep.o)(.text+0xad24):
In function `ssl_onceonlyinit':
: undefined reference to `RAND_seed'
/usr/lib/gcc-lib/i386-redhat-linux/3.3.2/../../../libc-client.a(osdep.o)(.text+0xb003):
In function `ssl_start_work':
: undefined reference to `TLSv1_client_method'
/usr/lib/gcc-lib/i386-redhat-linux/3.3.2/../../../libc-client.a(osdep.o)(.text+0xb00b):
In function `ssl_start_work':
: undefined reference to `SSL_CTX_new'
/usr/lib/gcc-lib/i386-redhat-linux/3.3.2/../../../libc-client.a(osdep.o)(.text+0xb04c):
In function `ssl_start_work':
: undefined reference to `SSL_CTX_ctrl'
/usr/lib/gcc-lib/i386-redhat-linux/3.3.2/../../../libc-client.a(osdep.o)(.text+0xb073):
In function `ssl_start_work':
: undefined reference to `SSL_CTX_set_verify'
/usr/lib/gcc-lib/i386-redhat-linux/3.3.2/../../../libc-client.a(osdep.o)(.text+0xb07e):
In function `ssl_start_work':
: undefined reference to `SSL_CTX_set_default_verify_paths'
/usr/lib/gcc-lib/i386-redhat-linux/3.3.2/../../../libc-client.a(osdep.o)(.text+0xb089):
In function `ssl_start_work':
: undefined reference to `SSL_new'
/usr/lib/gcc-lib/i386-redhat-linux/3.3.2/../../../libc-client.a(osdep.o)(.text+0xb0ab):
In function `ssl_start_work':
: undefined reference to `BIO_new_socket'
/usr/lib/gcc-lib/i386-redhat-linux/3.3.2/../../../libc-client.a(osdep.o)(.text+0xb0be):
In function `ssl_start_work':
: undefined reference to `SSL_set_bio'
/usr/lib/gcc-lib/i386-redhat-linux/3.3.2/../../../libc-client.a(osdep.o)(.text+0xb0c9):
In function `ssl_start_work':
: undefined reference to `SSL_set_connect_state'
/usr/lib/gcc-lib/i386-redhat-linux/3.3.2/../../../libc-client.a(osdep.o)(.text+0xb0d4):
In function `ssl_start_work':
: undefined reference to `SSL_state'
/usr/lib/gcc-lib/i386-redhat-linux/3.3.2/../../../libc-client.a(osdep.o)(.text+0xb100):
In function `ssl_start_work':
: undefined reference to `SSL_write'
/usr/lib/gcc-lib/i386-redhat-linux/3.3.2/../../../libc-client.a(osdep.o)(.text+0xb11f):
In function `ssl_start_work':
: undefined reference to `SSL_get_peer_certificate'
/usr/lib/gcc-lib/i386-redhat-linux/3.3.2/../../../libc-client.a(osdep.o)(.text+0xb211):
In function `ssl_start_work':
: undefined reference to `SSL_ctrl'
/usr/lib/gcc-lib/i386-redhat-linux/3.3.2/../../../libc-client.a(osdep.o)(.text+0xb238):
In function `ssl_start_work':
: undefined reference to `SSLv23_client_method'
/usr/lib/gcc-lib/i386-redhat-linux/3.3.2/../../../libc-client.a(osdep.o)(.text+0xb2bc):
In function `ssl_open_verify':
: undefined reference to `X509_STORE_CTX_get_error'
/usr/lib/gcc-lib/i386-redhat-linux/3.3.2/../../../libc-client.a(osdep.o)(.text+0xb2c4):
In function `ssl_open_verify':
: undefined reference to `X509_verify_cert_error_string'
/usr/lib/gcc-lib/i386-redhat-linux/3.3.2/../../../libc-client.a(osdep.o)(.text+0xb2d8):
In function `ssl_open_verify':
: undefined reference to `X509_STORE_CTX_get_current_cert'
/usr/lib/gcc-lib/i386-redhat-linux/3.3.2/../../../libc-client.a(osdep.o)(.text+0xb2e0):
In function `ssl_open_verify':
: undefined reference to `X509_get_subject_name'
/usr/lib/gcc-lib/i386-redhat-linux/3.3.2/../../../libc-client.a(osdep.o)(.text+0xb2f4):
In function `ssl_open_verify':
: undefined reference to `X509_NAME_oneline'
/usr/lib/gcc-lib/i386-redhat-linux/3.3.2/../../../libc-client.a(osdep.o)(.text+0xb77a):
In function `ssl_getdata':
: undefined reference to `SSL_get_fd'
/usr/lib/gcc-lib/i386-redhat-linux/3.3.2/../../../libc-client.a(osdep.o)(.text+0xb7cd):
In function `ssl_getdata':
: undefined reference to `SSL_pending'
/usr/lib/gcc-lib/i386-redhat-linux/3.3.2/../../../libc-client.a(osdep.o)(.text+0xb7f6):
In function `ssl_getdata':
: undefined reference to `SSL_read'
/usr/lib/gcc-lib/i386-redhat-linux/3.3.2/../../../libc-client.a(osdep.o)(.text+0xb818):
In function `ssl_getdata':
: undefined reference to `SSL_get_error'
/usr/lib/gcc-lib/i386-redhat-linux/3.3.2/../../../libc-client.a(osdep.o)(.text+0xbaf2):
In function `ssl_sout':
: undefined reference to `SSL_write'
/usr/lib/gcc-lib/i386-redhat-linux/3.3.2/../../../libc-client.a(osdep.o)(.text+0xbbf4):
In function `ssl_abort':
: undefined reference to `SSL_CTX_free'
/usr/lib/gcc-lib/i386-redhat-linux/3.3.2/../../../libc-client.a(osdep.o)(.text+0xbc05):
In function `ssl_abort':
: undefined reference to `SSL_shutdown'
/usr/lib/gcc-lib/i386-redhat-linux/3.3.2/../../../libc-client.a(osdep.o)(.text+0xbc10):
In function `ssl_abort':
: undefined reference to `SSL_free'
/usr/lib/gcc-lib/i386-redhat-linux/3.3.2/../../../libc-client.a(osdep.o)(.text+0xbe49):
In function `ssl_server_init':
: undefined reference to `ERR_load_crypto_strings'
/usr/lib/gcc-lib/i386-redhat-linux/3.3.2/../../../libc-client.a(osdep.o)(.text+0xbe4e):
In function `ssl_server_init':
: undefined reference to `SSL_load_error_strings'
/usr/lib/gcc-lib/i386-redhat-linux/3.3.2/../../../libc-client.a(osdep.o)(.text+0xbebb):
In function `ssl_server_init':
: undefined reference to `TLSv1_server_method'
/usr/lib/gcc-lib/i386-redhat-linux/3.3.2/../../../libc-client.a(osdep.o)(.text+0xbec3):
In function `ssl_server_init':
: undefined reference to `SSL_CTX_new'
/usr/lib/gcc-lib/i386-redhat-linux/3.3.2/../../../libc-client.a(osdep.o)(.text+0xbef7):
In function `ssl_server_init':
: undefined reference to `SSL_CTX_ctrl'
/usr/lib/gcc-lib/i386-redhat-linux/3.3.2/../../../libc-client.a(osdep.o)(.text+0xbf06):
In function `ssl_server_init':
: undefined reference to `SSL_CTX_set_cipher_list'
/usr/lib/gcc-lib/i386-redhat-linux/3.3.2/../../../libc-client.a(osdep.o)(.text+0xbf41):
In function `ssl_server_init':
: undefined reference to `ERR_get_error'
/usr/lib/gcc-lib/i386-redhat-linux/3.3.2/../../../libc-client.a(osdep.o)(.text+0xbf59):
In function `ssl_server_init':
: undefined reference to `ERR_error_string'
/usr/lib/gcc-lib/i386-redhat-linux/3.3.2/../../../libc-client.a(osdep.o)(.text+0xbf84):
In function `ssl_server_init':
: undefined reference to `SSL_CTX_use_certificate_chain_file'
/usr/lib/gcc-lib/i386-redhat-linux/3.3.2/../../../libc-client.a(osdep.o)(.text+0xbfc3):
In function `ssl_server_init':
: undefined reference to `SSL_CTX_use_RSAPrivateKey_file'
/usr/lib/gcc-lib/i386-redhat-linux/3.3.2/../../../libc-client.a(osdep.o)(.text+0xc008):
In function `ssl_server_init':
: undefined reference to `SSL_CTX_ctrl'
/usr/lib/gcc-lib/i386-redhat-linux/3.3.2/../../../libc-client.a(osdep.o)(.text+0xc01b):
In function `ssl_server_init':
: undefined reference to `SSL_new'
/usr/lib/gcc-lib/i386-redhat-linux/3.3.2/../../../libc-client.a(osdep.o)(.text+0xc059):
In function `ssl_server_init':
: undefined reference to `SSL_set_fd'
/usr/lib/gcc-lib/i386-redhat-linux/3.3.2/../../../libc-client.a(osdep.o)(.text+0xc064):
In function `ssl_server_init':
: undefined reference to `SSL_accept'
/usr/lib/gcc-lib/i386-redhat-linux/3.3.2/../../../libc-client.a(osdep.o)(.text+0xc132):
In function `ssl_server_init':
: undefined reference to `SSL_CTX_set_tmp_rsa_callback'
/usr/lib/gcc-lib/i386-redhat-linux/3.3.2/../../../libc-client.a(osdep.o)(.text+0xc151):
In function `ssl_server_init':
: undefined reference to `SSLv23_server_method'
/usr/lib/gcc-lib/i386-redhat-linux/3.3.2/../../../libc-client.a(osdep.o)(.text+0xc1ec):
In function `ssl_genkey':
: undefined reference to `RSA_generate_key'
/usr/lib/gcc-lib/i386-redhat-linux/3.3.2/../../../libc-client.a(osdep.o)(.text+0xc22a):
In function `ssl_genkey':
: undefined reference to `ERR_get_error'
/usr/lib/gcc-lib/i386-redhat-linux/3.3.2/../../../libc-client.a(osdep.o)(.text+0xc23e):
In function `ssl_genkey':
: undefined reference to `ERR_error_string'
/usr/lib/gcc-lib/i386-redhat-linux/3.3.2/../../../libc-client.a(osdep.o)(.text+0xc2b1):
In function `ssl_server_input_wait':
: undefined reference to `SSL_get_fd'
/usr/lib/gcc-lib/i386-redhat-linux/3.3.2/../../../libc-client.a(osdep.o)(.text+0xc2c6):
In function `ssl_server_input_wait':
: undefined reference to `SSL_pending'
/usr/lib/gcc-lib/i386-redhat-linux/3.3.2/../../../libc-client.a(osdep.o)(.text+0xc2ea):
In function `ssl_server_input_wait':
: undefined reference to `SSL_read'
collect2: ld returned 1 exit status
configure: failed program was:
#line 41298 "configure"
#include "confdefs.h"
void mm_log(void){}
void mm_dlog(void){}
void mm_flags(void){}
void mm_fatal(void){}
void mm_critical(void){}
void mm_nocritical(void){}
void mm_notify(void){}
void mm_login(void){}
void mm_diskerror(void){}
void mm_status(void){}
void mm_lsub(void){}
void mm_list(void){}
void mm_exists(void){}
void mm_searched(void){}
void mm_expunged(void){}
char auth_gssapi_valid();
int main() {
auth_gssapi_valid();
return 0;
}
configure:41349: checking whether IMAP works
configure:41382: gcc -o conftest -g -O2 conftest.c -lc-client -lcrypt
-lpam
-lresolv -lm -ldl -lnsl -lgssapi_krb5 -lkrb5 -lk5crypto -lcom_err 1>&5
/usr/lib/gcc-lib/i386-redhat-linux/3.3.2/../../../libc-client.a(osdep.o)(.text+0xabf7):
In function `ssl_onceonlyinit':
: warning: the use of tmpnam' is dangerous, better use mkstemp'
/usr/lib/gcc-lib/i386-redhat-linux/3.3.2/../../../libc-client.a(osdep.o)(.text+0xabe7):
In function `ssl_onceonlyinit':
: undefined reference to `SSL_library_init'
/usr/lib/gcc-lib/i386-redhat-linux/3.3.2/../../../libc-client.a(osdep.o)(.text+0xad24):
In function `ssl_onceonlyinit':
: undefined reference to `RAND_seed'
/usr/lib/gcc-lib/i386-redhat-linux/3.3.2/../../../libc-client.a(osdep.o)(.text+0xb003):
In function `ssl_start_work':
: undefined reference to `TLSv1_client_method'
/usr/lib/gcc-lib/i386-redhat-linux/3.3.2/../../../libc-client.a(osdep.o)(.text+0xb00b):
In function `ssl_start_work':
: undefined reference to `SSL_CTX_new'
/usr/lib/gcc-lib/i386-redhat-linux/3.3.2/../../../libc-client.a(osdep.o)(.text+0xb04c):
In function `ssl_start_work':
: undefined reference to `SSL_CTX_ctrl'
/usr/lib/gcc-lib/i386-redhat-linux/3.3.2/../../../libc-client.a(osdep.o)(.text+0xb073):
In function `ssl_start_work':
: undefined reference to `SSL_CTX_set_verify'
/usr/lib/gcc-lib/i386-redhat-linux/3.3.2/../../../libc-client.a(osdep.o)(.text+0xb07e):
In function `ssl_start_work':
: undefined reference to `SSL_CTX_set_default_verify_paths'
/usr/lib/gcc-lib/i386-redhat-linux/3.3.2/../../../libc-client.a(osdep.o)(.text+0xb089):
In function `ssl_start_work':
: undefined reference to `SSL_new'
/usr/lib/gcc-lib/i386-redhat-linux/3.3.2/../../../libc-client.a(osdep.o)(.text+0xb0ab):
In function `ssl_start_work':
: undefined reference to `BIO_new_socket'
/usr/lib/gcc-lib/i386-redhat-linux/3.3.2/../../../libc-client.a(osdep.o)(.text+0xb0be):
In function `ssl_start_work':
: undefined reference to `SSL_set_bio'
/usr/lib/gcc-lib/i386-redhat-linux/3.3.2/../../../libc-client.a(osdep.o)(.text+0xb0c9):
In function `ssl_start_work':
: undefined reference to `SSL_set_connect_state'
/usr/lib/gcc-lib/i386-redhat-linux/3.3.2/../../../libc-client.a(osdep.o)(.text+0xb0d4):
In function `ssl_start_work':
: undefined reference to `SSL_state'
/usr/lib/gcc-lib/i386-redhat-linux/3.3.2/../../../libc-client.a(osdep.o)(.text+0xb100):
In function `ssl_start_work':
: undefined reference to `SSL_write'
/usr/lib/gcc-lib/i386-redhat-linux/3.3.2/../../../libc-client.a(osdep.o)(.text+0xb11f):
In function `ssl_start_work':
: undefined reference to `SSL_get_peer_certificate'
/usr/lib/gcc-lib/i386-redhat-linux/3.3.2/../../../libc-client.a(osdep.o)(.text+0xb211):
In function `ssl_start_work':
: undefined reference to `SSL_ctrl'
/usr/lib/gcc-lib/i386-redhat-linux/3.3.2/../../../libc-client.a(osdep.o)(.text+0xb238):
In function `ssl_start_work':
: undefined reference to `SSLv23_client_method'
/usr/lib/gcc-lib/i386-redhat-linux/3.3.2/../../../libc-client.a(osdep.o)(.text+0xb2bc):
In function `ssl_open_verify':
: undefined reference to `X509_STORE_CTX_get_error'
/usr/lib/gcc-lib/i386-redhat-linux/3.3.2/../../../libc-client.a(osdep.o)(.text+0xb2c4):
In function `ssl_open_verify':
: undefined reference to `X509_verify_cert_error_string'
/usr/lib/gcc-lib/i386-redhat-linux/3.3.2/../../../libc-client.a(osdep.o)(.text+0xb2d8):
In function `ssl_open_verify':
: undefined reference to `X509_STORE_CTX_get_current_cert'
/usr/lib/gcc-lib/i386-redhat-linux/3.3.2/../../../libc-client.a(osdep.o)(.text+0xb2e0):
In function `ssl_open_verify':
: undefined reference to `X509_get_subject_name'
/usr/lib/gcc-lib/i386-redhat-linux/3.3.2/../../../libc-client.a(osdep.o)(.text+0xb2f4):
In function `ssl_open_verify':
: undefined reference to `X509_NAME_oneline'
/usr/lib/gcc-lib/i386-redhat-linux/3.3.2/../../../libc-client.a(osdep.o)(.text+0xb77a):
In function `ssl_getdata':
: undefined reference to `SSL_get_fd'
/usr/lib/gcc-lib/i386-redhat-linux/3.3.2/../../../libc-client.a(osdep.o)(.text+0xb7cd):
In function `ssl_getdata':
: undefined reference to `SSL_pending'
/usr/lib/gcc-lib/i386-redhat-linux/3.3.2/../../../libc-client.a(osdep.o)(.text+0xb7f6):
In function `ssl_getdata':
: undefined reference to `SSL_read'
/usr/lib/gcc-lib/i386-redhat-linux/3.3.2/../../../libc-client.a(osdep.o)(.text+0xb818):
In function `ssl_getdata':
: undefined reference to `SSL_get_error'
/usr/lib/gcc-lib/i386-redhat-linux/3.3.2/../../../libc-client.a(osdep.o)(.text+0xbaf2):
In function `ssl_sout':
: undefined reference to `SSL_write'
/usr/lib/gcc-lib/i386-redhat-linux/3.3.2/../../../libc-client.a(osdep.o)(.text+0xbbf4):
In function `ssl_abort':
: undefined reference to `SSL_CTX_free'
/usr/lib/gcc-lib/i386-redhat-linux/3.3.2/../../../libc-client.a(osdep.o)(.text+0xbc05):
In function `ssl_abort':
: undefined reference to `SSL_shutdown'
/usr/lib/gcc-lib/i386-redhat-linux/3.3.2/../../../libc-client.a(osdep.o)(.text+0xbc10):
In function `ssl_abort':
: undefined reference to `SSL_free'
/usr/lib/gcc-lib/i386-redhat-linux/3.3.2/../../../libc-client.a(osdep.o)(.text+0xbe49):
In function `ssl_server_init':
: undefined reference to `ERR_load_crypto_strings'
/usr/lib/gcc-lib/i386-redhat-linux/3.3.2/../../../libc-client.a(osdep.o)(.text+0xbe4e):
In function `ssl_server_init':
: undefined reference to `SSL_load_error_strings'
/usr/lib/gcc-lib/i386-redhat-linux/3.3.2/../../../libc-client.a(osdep.o)(.text+0xbebb):
In function `ssl_server_init':
: undefined reference to `TLSv1_server_method'
/usr/lib/gcc-lib/i386-redhat-linux/3.3.2/../../../libc-client.a(osdep.o)(.text+0xbec3):
In function `ssl_server_init':
: undefined reference to `SSL_CTX_new'
/usr/lib/gcc-lib/i386-redhat-linux/3.3.2/../../../libc-client.a(osdep.o)(.text+0xbef7):
In function `ssl_server_init':
: undefined reference to `SSL_CTX_ctrl'
/usr/lib/gcc-lib/i386-redhat-linux/3.3.2/../../../libc-client.a(osdep.o)(.text+0xbf06):
In function `ssl_server_init':
: undefined reference to `SSL_CTX_set_cipher_list'
/usr/lib/gcc-lib/i386-redhat-linux/3.3.2/../../../libc-client.a(osdep.o)(.text+0xbf41):
In function `ssl_server_init':
: undefined reference to `ERR_get_error'
/usr/lib/gcc-lib/i386-redhat-linux/3.3.2/../../../libc-client.a(osdep.o)(.text+0xbf59):
In function `ssl_server_init':
: undefined reference to `ERR_error_string'
/usr/lib/gcc-lib/i386-redhat-linux/3.3.2/../../../libc-client.a(osdep.o)(.text+0xbf84):
In function `ssl_server_init':
: undefined reference to `SSL_CTX_use_certificate_chain_file'
/usr/lib/gcc-lib/i386-redhat-linux/3.3.2/../../../libc-client.a(osdep.o)(.text+0xbfc3):
In function `ssl_server_init':
: undefined reference to `SSL_CTX_use_RSAPrivateKey_file'
/usr/lib/gcc-lib/i386-redhat-linux/3.3.2/../../../libc-client.a(osdep.o)(.text+0xc008):
In function `ssl_server_init':
: undefined reference to `SSL_CTX_ctrl'
/usr/lib/gcc-lib/i386-redhat-linux/3.3.2/../../../libc-client.a(osdep.o)(.text+0xc01b):
In function `ssl_server_init':
: undefined reference to `SSL_new'
/usr/lib/gcc-lib/i386-redhat-linux/3.3.2/../../../libc-client.a(osdep.o)(.text+0xc059):
In function `ssl_server_init':
: undefined reference to `SSL_set_fd'
/usr/lib/gcc-lib/i386-redhat-linux/3.3.2/../../../libc-client.a(osdep.o)(.text+0xc064):
In function `ssl_server_init':
: undefined reference to `SSL_accept'
/usr/lib/gcc-lib/i386-redhat-linux/3.3.2/../../../libc-client.a(osdep.o)(.text+0xc132):
In function `ssl_server_init':
: undefined reference to `SSL_CTX_set_tmp_rsa_callback'
/usr/lib/gcc-lib/i386-redhat-linux/3.3.2/../../../libc-client.a(osdep.o)(.text+0xc151):
In function `ssl_server_init':
: undefined reference to `SSLv23_server_method'
/usr/lib/gcc-lib/i386-redhat-linux/3.3.2/../../../libc-client.a(osdep.o)(.text+0xc1ec):
In function `ssl_genkey':
: undefined reference to `RSA_generate_key'
/usr/lib/gcc-lib/i386-redhat-linux/3.3.2/../../../libc-client.a(osdep.o)(.text+0xc22a):
In function `ssl_genkey':
: undefined reference to `ERR_get_error'
/usr/lib/gcc-lib/i386-redhat-linux/3.3.2/../../../libc-client.a(osdep.o)(.text+0xc23e):
In function `ssl_genkey':
: undefined reference to `ERR_error_string'
/usr/lib/gcc-lib/i386-redhat-linux/3.3.2/../../../libc-client.a(osdep.o)(.text+0xc2b1):
In function `ssl_server_input_wait':
: undefined reference to `SSL_get_fd'
/usr/lib/gcc-lib/i386-redhat-linux/3.3.2/../../../libc-client.a(osdep.o)(.text+0xc2c6):
In function `ssl_server_input_wait':
: undefined reference to `SSL_pending'
/usr/lib/gcc-lib/i386-redhat-linux/3.3.2/../../../libc-client.a(osdep.o)(.text+0xc2ea):
In function `ssl_server_input_wait':
: undefined reference to `SSL_read'
collect2: ld returned 1 exit status
configure: failed program was:
#line 41357 "configure"
#include "confdefs.h"
void mm_log(void){}
void mm_dlog(void){}
void mm_flags(void){}
void mm_fatal(void){}
void mm_critical(void){}
void mm_nocritical(void){}
void mm_notify(void){}
void mm_login(void){}
void mm_diskerror(void){}
void mm_status(void){}
void mm_lsub(void){}
void mm_list(void){}
void mm_exists(void){}
void mm_searched(void){}
void mm_expunged(void){}
char mail_newbody();
int main() {
mail_newbody();
return 0;
}
Download this as a file
Delete & Prev | Delete & Next
Move to: INBOX Drafts Sent Trash Saved