Install Problem - 2nd Request

From: Date: Tue, 23 Jan 2001 16:50:59 +0000
Subject: Install Problem - 2nd Request
Groups: php.install 
Request: Send a blank email to php-install+get-1756@lists.php.net to get a copy of this message
Tried with 4.04pl1 and I still get the following after a make: How do I fix this?? George >On Fri, 12 Jan 2001 10:15:23 -0600, George R. Kasica <georgek@netwrx1.com> wrote: Hello: Trying to install 4.0.4 and am getting the following after typing make: M -DXML_BYTE_ORDER=12 -g -O2 -c microtime.c && touch microtime.lo microtime.c: In function `php_if_getrusage': microtime.c:97: storage size of `usg' isn't known microtime.c:100: `RUSAGE_SELF' undeclared (first use in this function) microtime.c:100: (Each undeclared identifier is reported only once microtime.c:100: for each function it appears in.) microtime.c:106: `RUSAGE_CHILDREN' undeclared (first use in this function) make[3]: *** [microtime.lo] Error 1 make[3]: Leaving directory `/mnt/scsi-1/Linux/FP2K/www-src/php-4.0.4/ext/standar d' make[2]: *** [all-recursive] Error 1 make[2]: Leaving directory `/mnt/scsi-1/Linux/FP2K/www-src/php-4.0.4/ext/standar d' make[1]: *** [all-recursive] Error 1 make[1]: Leaving directory `/mnt/scsi-1/Linux/FP2K/www-src/php-4.0.4/ext' make: *** [all-recursive] Error 1 How can I fix this to get it to compile?? Thanks, George ===[George R. Kasica]=== +1 262 513 8503 President +1 206 374 6482 FAX Netwrx Consulting Inc. Waukesha, WI USA http://www.netwrx1.com georgek@netwrx1.com ICQ #12862186

« previous php.install (#1756) next »