PHP 7.1.3 with openssl
| From: | Satish Chhatpar 02 | Date: | Wed, 17 Apr 2019 11:10:26 +0000 |
| Subject: | PHP 7.1.3 with openssl | ||
| Groups: | php.install | ||
| Request: | Send a blank email to php-install+get-20509@lists.php.net to get a copy of this message | ||
Hi,
I am compiling PHP with openssl, but getting error.
Could you help ?
Red Hat Enterprise Linux Server release 6.7 (Santiago)
php-7.1.3
OpenSSL 1.1.0j 20 Nov 2018
collect2: ld returned 1 exit status
make: *** [sapi/cli/php] Error 1
Regards
Satish Chhatpar
IMI DIXONS CARPHONE MIDDLEWARE | IBM India Pvt Ltd. Banglore
e-mail : schhatpa@in.ibm.com |Team DL - IBMIndiaMW-CPW-IBM-UK@cpwplc.com | Mobile : +91 98802 99379
::DISCLAIMER::
________________________________________________________________________________________________________________
Confidentiality Notice from Dixons Carphone plc (registered in England & Wales No.07105905) of 1
Portal Way, London, W3 6RS ("Dixons Carphone"). The information contained in this e-mail
and any attachments may be legally privileged, proprietary and/or confidential. If you received this
e-mail in error, please notify the sender by return, permanently delete the e-mail and destroy all
hard copies immediately. No warranty is made as to the completeness or accuracy of the information
contained in this e-mail. Opinions, conclusions and statements of intent in this e-mail are those of
the sender and will not bind any Dixons Carphone group company (Dixons Carphone Group) unless
confirmed by an authorised representative independently of this e-mail.. We do not accept
responsibility for viruses; you must scan for these. E-mails sent to and from Dixons Carphone Group
are routinely monitored for record keeping, quality control, training purposes, to ensure regulatory
compliance and to prevent viruses and unauthorised use of our computer systems. The Carphone
Warehouse Limited (registered in England & Wales No.02142673) is a member of the Dixons Carphone
Group and is authorised and regulated by the Financial Conduct Authority.
________________________________________________________________________________________________________________
ext/openssl/.libs/openssl.o: In function `sk_X509_pop': /usr/local/include/openssl/x509.h:97: undefined reference to `OPENSSL_sk_pop' ext/openssl/.libs/openssl.o: In function `zm_info_openssl': /var/tmp_php/php-7.1.3/ext/openssl/openssl.c:1559: undefined reference to `OpenSSL_version' ext/openssl/.libs/openssl.o: In function `zm_startup_openssl': /var/tmp_php/php-7.1.3/ext/openssl/openssl.c:1396: undefined reference to `OPENSSL_init_ssl' /var/tmp_php/php-7.1.3/ext/openssl/openssl.c:1397: undefined reference to `OPENSSL_init_crypto' /var/tmp_php/php-7.1.3/ext/openssl/openssl.c:1398: undefined reference to `OPENSSL_init_crypto' /var/tmp_php/php-7.1.3/ext/openssl/openssl.c:1399: undefined reference to `OPENSSL_init_crypto' /var/tmp_php/php-7.1.3/ext/openssl/openssl.c:1407: undefined reference to `OPENSSL_init_ssl' ext/openssl/.libs/openssl.o: In function `zif_openssl_decrypt': /var/tmp_php/php-7.1.3/ext/openssl/openssl.c:6513: undefined reference to `EVP_CIPHER_CTX_reset' ext/openssl/.libs/openssl.o: In function `zif_openssl_encrypt': /var/tmp_php/php-7.1.3/ext/openssl/openssl.c:6426: undefined reference to `EVP_CIPHER_CTX_reset' ext/openssl/.libs/openssl.o: In function `zif_openssl_digest': /var/tmp_php/php-7.1.3/ext/openssl/openssl.c:6111: undefined reference to `EVP_MD_CTX_new' /var/tmp_php/php-7.1.3/ext/openssl/openssl.c:6134: undefined reference to `EVP_MD_CTX_free' ext/openssl/.libs/openssl.o: In function `zif_openssl_dh_compute_key': /var/tmp_php/php-7.1.3/ext/openssl/openssl.c:4838: undefined reference to `EVP_PKEY_get0_DH' ext/openssl/.libs/openssl.o: In function `zif_openssl_pkey_get_details': /var/tmp_php/php-7.1.3/ext/openssl/openssl.c:4750: undefined reference to `EVP_PKEY_get0_EC_KEY' /var/tmp_php/php-7.1.3/ext/openssl/openssl.c:4759: undefined reference to `EVP_PKEY_get0_EC_KEY' /var/tmp_php/php-7.1.3/ext/openssl/openssl.c:4677: undefined reference to `EVP_PKEY_get0_RSA' /var/tmp_php/php-7.1.3/ext/openssl/openssl.c:4684: undefined reference to `RSA_get0_key' /var/tmp_php/php-7.1.3/ext/openssl/openssl.c:4685: undefined reference to `RSA_get0_factors' /var/tmp_php/php-7.1.3/ext/openssl/openssl.c:4686: undefined reference to `RSA_get0_crt_params' /var/tmp_php/php-7.1.3/ext/openssl/openssl.c:4728: undefined reference to `EVP_PKEY_get0_DH' /var/tmp_php/php-7.1.3/ext/openssl/openssl.c:4735: undefined reference to `DH_get0_pqg' /var/tmp_php/php-7.1.3/ext/openssl/openssl.c:4736: undefined reference to `DH_get0_key' /var/tmp_php/php-7.1.3/ext/openssl/openssl.c:4706: undefined reference to `EVP_PKEY_get0_DSA' /var/tmp_php/php-7.1.3/ext/openssl/openssl.c:4713: undefined reference to `DSA_get0_pqg' /var/tmp_php/php-7.1.3/ext/openssl/openssl.c:4714: undefined reference to `DSA_get0_key' /var/tmp_php/php-7.1.3/ext/openssl/openssl.c:4795: undefined reference to `EVP_PKEY_get0_EC_KEY' ext/openssl/.libs/openssl.o: In function `php_openssl_pkey_init_dh': /var/tmp_php/php-7.1.3/ext/openssl/openssl.c:4180: undefined reference to `DH_set0_pqg' ext/openssl/.libs/openssl.o: In function `php_openssl_dh_pub_from_priv': /var/tmp_php/php-7.1.3/ext/openssl/openssl.c:4157: undefined reference to `BN_with_flags' ext/openssl/.libs/openssl.o: In function `php_openssl_pkey_init_dh': /var/tmp_php/php-7.1.3/ext/openssl/openssl.c:4194: undefined reference to `DH_set0_key' /var/tmp_php/php-7.1.3/ext/openssl/openssl.c:4187: undefined reference to `DH_set0_key' ext/openssl/.libs/openssl.o: In function `php_openssl_pkey_init_dsa': /var/tmp_php/php-7.1.3/ext/openssl/openssl.c:4103: undefined reference to `DSA_set0_pqg' /var/tmp_php/php-7.1.3/ext/openssl/openssl.c:4110: undefined reference to `DSA_set0_key' /var/tmp_php/php-7.1.3/ext/openssl/openssl.c:4122: undefined reference to `DSA_get0_key' /var/tmp_php/php-7.1.3/ext/openssl/openssl.c:4123: undefined reference to `BN_is_zero' ext/openssl/.libs/openssl.o: In function `php_openssl_pkey_init_and_assign_rsa': /var/tmp_php/php-7.1.3/ext/openssl/openssl.c:4069: undefined reference to `RSA_set0_key' /var/tmp_php/php-7.1.3/ext/openssl/openssl.c:4082: undefined reference to `RSA_set0_crt_params' /var/tmp_php/php-7.1.3/ext/openssl/openssl.c:4075: undefined reference to `RSA_set0_factors' ext/openssl/.libs/openssl.o: In function `sk_X509_num': /usr/local/include/openssl/x509.h:97: undefined reference to `OPENSSL_sk_num' /usr/local/include/openssl/x509.h:97: undefined reference to `OPENSSL_sk_num' ext/openssl/.libs/openssl.o: In function `sk_X509_pop': /usr/local/include/openssl/x509.h:97: undefined reference to `OPENSSL_sk_pop' ext/openssl/.libs/openssl.o: In function `sk_X509_free': /usr/local/include/openssl/x509.h:97: undefined reference to `OPENSSL_sk_free' ext/openssl/.libs/openssl.o: In function `sk_X509_new_null': /usr/local/include/openssl/x509.h:97: undefined reference to `OPENSSL_sk_new_null' ext/openssl/.libs/openssl.o: In function `sk_X509_push': /usr/local/include/openssl/x509.h:97: undefined reference to `OPENSSL_sk_push' /usr/local/include/openssl/x509.h:97: undefined reference to `OPENSSL_sk_push' ext/openssl/.libs/openssl.o: In function `zif_openssl_x509_parse': /var/tmp_php/php-7.1.3/ext/openssl/openssl.c:2307: undefined reference to `X509_get_version' /var/tmp_php/php-7.1.3/ext/openssl/openssl.c:2334: undefined reference to `X509_getm_notBefore' /var/tmp_php/php-7.1.3/ext/openssl/openssl.c:2335: undefined reference to `X509_getm_notAfter' /var/tmp_php/php-7.1.3/ext/openssl/openssl.c:2337: undefined reference to `X509_getm_notBefore' /var/tmp_php/php-7.1.3/ext/openssl/openssl.c:2338: undefined reference to `X509_getm_notAfter' /var/tmp_php/php-7.1.3/ext/openssl/openssl.c:2345: undefined reference to `X509_get_signature_nid' ext/openssl/.libs/openssl.o: In function `sk_GENERAL_NAME_pop_free': /usr/local/include/openssl/x509v3.h:165: undefined reference to `OPENSSL_sk_pop_free' ext/openssl/.libs/openssl.o: In function `sk_GENERAL_NAME_num': /usr/local/include/openssl/x509v3.h:165: undefined reference to `OPENSSL_sk_num' ext/openssl/.libs/openssl.o: In function `sk_GENERAL_NAME_value': /usr/local/include/openssl/x509v3.h:165: undefined reference to `OPENSSL_sk_value' ext/openssl/.libs/openssl.o: In function `sk_X509_new_null': /usr/local/include/openssl/x509.h:97: undefined reference to `OPENSSL_sk_new_null' ext/openssl/.libs/openssl.o: In function `sk_X509_INFO_shift': /usr/local/include/openssl/x509.h:252: undefined reference to `OPENSSL_sk_shift' ext/openssl/.libs/openssl.o: In function `sk_X509_push': /usr/local/include/openssl/x509.h:97: undefined reference to `OPENSSL_sk_push' ext/openssl/.libs/openssl.o: In function `sk_X509_INFO_num': /usr/local/include/openssl/x509.h:252: undefined reference to `OPENSSL_sk_num' ext/openssl/.libs/openssl.o: In function `sk_X509_num': /usr/local/include/openssl/x509.h:97: undefined reference to `OPENSSL_sk_num' ext/openssl/.libs/openssl.o: In function `sk_X509_INFO_free': /usr/local/include/openssl/x509.h:252: undefined reference to `OPENSSL_sk_free' ext/openssl/.libs/openssl.o: In function `sk_X509_free': /usr/local/include/openssl/x509.h:97: undefined reference to `OPENSSL_sk_free' /usr/local/include/openssl/x509.h:97: undefined reference to `OPENSSL_sk_free' /usr/local/include/openssl/x509.h:97: undefined reference to `OPENSSL_sk_free' ext/openssl/.libs/openssl.o: In function `sk_X509_pop_free': /usr/local/include/openssl/x509.h:97: undefined reference to `OPENSSL_sk_pop_free' ext/openssl/.libs/openssl.o: In function `sk_CONF_VALUE_num': /usr/local/include/openssl/conf.h:31: undefined reference to `OPENSSL_sk_num' ext/openssl/.libs/openssl.o: In function `sk_CONF_VALUE_value': /usr/local/include/openssl/conf.h:31: undefined reference to `OPENSSL_sk_value' ext/openssl/.libs/openssl.o: In function `php_openssl_is_private_key': /var/tmp_php/php-7.1.3/ext/openssl/openssl.c:3985: undefined reference to `EVP_PKEY_get0_DSA' /var/tmp_php/php-7.1.3/ext/openssl/openssl.c:3989: undefined reference to `DSA_get0_pqg' /var/tmp_php/php-7.1.3/ext/openssl/openssl.c:3994: undefined reference to `DSA_get0_key' /var/tmp_php/php-7.1.3/ext/openssl/openssl.c:3968: undefined reference to `EVP_PKEY_get0_RSA' /var/tmp_php/php-7.1.3/ext/openssl/openssl.c:3972: undefined reference to `RSA_get0_factors' /var/tmp_php/php-7.1.3/ext/openssl/openssl.c:4003: undefined reference to `EVP_PKEY_get0_DH' /var/tmp_php/php-7.1.3/ext/openssl/openssl.c:4007: undefined reference to `DH_get0_pqg' /var/tmp_php/php-7.1.3/ext/openssl/openssl.c:4012: undefined reference to `DH_get0_key' /var/tmp_php/php-7.1.3/ext/openssl/openssl.c:4022: undefined reference to `EVP_PKEY_get0_EC_KEY' ext/openssl/.libs/openssl.o: In function `zif_openssl_seal': /var/tmp_php/php-7.1.3/ext/openssl/openssl.c:5879: undefined reference to `EVP_CIPHER_CTX_reset' ext/openssl/.libs/openssl.o: In function `zif_openssl_verify': /var/tmp_php/php-7.1.3/ext/openssl/openssl.c:5785: undefined reference to `EVP_MD_CTX_new' /var/tmp_php/php-7.1.3/ext/openssl/openssl.c:5792: undefined reference to `EVP_MD_CTX_free' ext/openssl/.libs/openssl.o: In function `zif_openssl_sign': /var/tmp_php/php-7.1.3/ext/openssl/openssl.c:5718: undefined reference to `EVP_MD_CTX_new' /var/tmp_php/php-7.1.3/ext/openssl/openssl.c:5733: undefined reference to `EVP_MD_CTX_free' ext/openssl/.libs/openssl.o: In function `zif_openssl_public_decrypt': /var/tmp_php/php-7.1.3/ext/openssl/openssl.c:5610: undefined reference to `EVP_PKEY_get0_RSA' ext/openssl/.libs/openssl.o: In function `zif_openssl_public_encrypt': /var/tmp_php/php-7.1.3/ext/openssl/openssl.c:5547: undefined reference to `EVP_PKEY_get0_RSA' ext/openssl/.libs/openssl.o: In function `zif_openssl_private_decrypt': /var/tmp_php/php-7.1.3/ext/openssl/openssl.c:5479: undefined reference to `EVP_PKEY_get0_RSA' ext/openssl/.libs/openssl.o: In function `zif_openssl_private_encrypt': /var/tmp_php/php-7.1.3/ext/openssl/openssl.c:5417: undefined reference to `EVP_PKEY_get0_RSA' ext/openssl/.libs/openssl.o: In function `zif_openssl_pkey_export': /var/tmp_php/php-7.1.3/ext/openssl/openssl.c:4547: undefined reference to `EVP_PKEY_get0_EC_KEY' ext/openssl/.libs/openssl.o: In function `zif_openssl_pkey_export_to_file': /var/tmp_php/php-7.1.3/ext/openssl/openssl.c:4473: undefined reference to `EVP_PKEY_get0_EC_KEY' ext/openssl/.libs/openssl.o: In function `php_openssl_make_REQ': /var/tmp_php/php-7.1.3/ext/openssl/openssl.c:3045: undefined reference to `X509_REQ_get_subject_name' ext/openssl/.libs/openssl.o: In function `sk_CONF_VALUE_num': /usr/local/include/openssl/conf.h:31: undefined reference to `OPENSSL_sk_num' ext/openssl/.libs/openssl.o: In function `sk_CONF_VALUE_value': /usr/local/include/openssl/conf.h:31: undefined reference to `OPENSSL_sk_value' ext/openssl/.libs/openssl.o: In function `sk_CONF_VALUE_num': /usr/local/include/openssl/conf.h:31: undefined reference to `OPENSSL_sk_num' /usr/local/include/openssl/conf.h:31: undefined reference to `OPENSSL_sk_num' ext/openssl/.libs/openssl.o: In function `sk_CONF_VALUE_value': /usr/local/include/openssl/conf.h:31: undefined reference to `OPENSSL_sk_value' ext/openssl/.libs/openssl.o: In function `sk_X509_new_null': /usr/local/include/openssl/x509.h:97: undefined reference to `OPENSSL_sk_new_null' ext/openssl/.libs/openssl.o: In function `sk_X509_push': /usr/local/include/openssl/x509.h:97: undefined reference to `OPENSSL_sk_push' /usr/local/include/openssl/x509.h:97: undefined reference to `OPENSSL_sk_push' ext/openssl/.libs/openssl.o: In function `sk_X509_pop_free': /usr/local/include/openssl/x509.h:97: undefined reference to `OPENSSL_sk_pop_free' /usr/local/include/openssl/x509.h:97: undefined reference to `OPENSSL_sk_pop_free' ext/openssl/.libs/openssl.o: In function `zif_openssl_csr_get_subject': /var/tmp_php/php-7.1.3/ext/openssl/openssl.c:3575: undefined reference to `X509_REQ_get_subject_name' ext/openssl/.libs/openssl.o: In function `zif_openssl_csr_sign': /var/tmp_php/php-7.1.3/ext/openssl/openssl.c:3406: undefined reference to `X509_REQ_get_subject_name' /var/tmp_php/php-7.1.3/ext/openssl/openssl.c:3415: undefined reference to `X509_getm_notBefore' /var/tmp_php/php-7.1.3/ext/openssl/openssl.c:3416: undefined reference to `X509_getm_notAfter' ext/openssl/.libs/openssl.o: In function `sk_X509_value': /usr/local/include/openssl/x509.h:97: undefined reference to `OPENSSL_sk_value' ext/openssl/.libs/openssl.o: In function `sk_X509_num': /usr/local/include/openssl/x509.h:97: undefined reference to `OPENSSL_sk_num' ext/openssl/.libs/openssl.o: In function `sk_X509_free': /usr/local/include/openssl/x509.h:97: undefined reference to `OPENSSL_sk_free' /usr/local/include/openssl/x509.h:97: undefined reference to `OPENSSL_sk_free' /usr/local/include/openssl/x509.h:97: undefined reference to `OPENSSL_sk_free' ext/openssl/.libs/xp_ssl.o: In function `sk_X509_num': /usr/local/include/openssl/x509.h:97: undefined reference to `OPENSSL_sk_num' ext/openssl/.libs/xp_ssl.o: In function `sk_X509_value': /usr/local/include/openssl/x509.h:97: undefined reference to `OPENSSL_sk_value' ext/openssl/.libs/xp_ssl.o: In function `sk_X509_num': /usr/local/include/openssl/x509.h:97: undefined reference to `OPENSSL_sk_num' ext/openssl/.libs/xp_ssl.o: In function `set_server_specific_opts': /var/tmp_php/php-7.1.3/ext/openssl/xp_ssl.c:1241: undefined reference to `SSL_CTX_get_options' /var/tmp_php/php-7.1.3/ext/openssl/xp_ssl.c:1268: undefined reference to `SSL_CTX_set_options' ext/openssl/.libs/xp_ssl.o: In function `enable_server_sni': /var/tmp_php/php-7.1.3/ext/openssl/xp_ssl.c:1359: undefined reference to `TLS_server_method' ext/openssl/.libs/xp_ssl.o: In function `php_openssl_setup_crypto': /var/tmp_php/php-7.1.3/ext/openssl/xp_ssl.c:1512: undefined reference to `TLS_client_method' /var/tmp_php/php-7.1.3/ext/openssl/xp_ssl.c:1579: undefined reference to `SSL_CTX_set_alpn_select_cb' /var/tmp_php/php-7.1.3/ext/openssl/xp_ssl.c:1594: undefined reference to `SSL_CTX_set_options' /var/tmp_php/php-7.1.3/ext/openssl/xp_ssl.c:1512: undefined reference to `TLS_server_method' /var/tmp_php/php-7.1.3/ext/openssl/xp_ssl.c:1574: undefined reference to `SSL_CTX_set_alpn_protos' ext/openssl/.libs/xp_ssl.o: In function `php_openssl_sockop_set_option': /var/tmp_php/php-7.1.3/ext/openssl/xp_ssl.c:2289: undefined reference to `SSL_get0_alpn_selected' ext/openssl/.libs/xp_ssl.o: In function `sk_GENERAL_NAME_num': /usr/local/include/openssl/x509v3.h:165: undefined reference to `OPENSSL_sk_num' ext/openssl/.libs/xp_ssl.o: In function `sk_GENERAL_NAME_value': /usr/local/include/openssl/x509v3.h:165: undefined reference to `OPENSSL_sk_value' ext/phar/.libs/util.o: In function `phar_create_signature': /var/tmp_php/php-7.1.3/ext/phar/util.c:1860: undefined reference to `EVP_MD_CTX_new' /var/tmp_php/php-7.1.3/ext/phar/util.c:1892: undefined reference to `EVP_MD_CTX_free' ext/phar/.libs/util.o: In function `phar_verify_signature': /var/tmp_php/php-7.1.3/ext/phar/util.c:1563: undefined reference to `EVP_MD_CTX_new' /var/tmp_php/php-7.1.3/ext/phar/util.c:1595: undefined reference to `EVP_MD_CTX_free' /var/tmp_php/php-7.1.3/ext/phar/util.c:1586: undefined reference to `EVP_MD_CTX_free' collect2: ld returned 1 exit status make: *** [sapi/cli/php] Error 1
ext/openssl/.libs/openssl.o: In function `sk_X509_pop': /usr/local/include/openssl/x509.h:97: undefined reference to `OPENSSL_sk_pop' ext/openssl/.libs/openssl.o: In function `zm_info_openssl': /var/tmp_php/php-7.1.3/ext/openssl/openssl.c:1559: undefined reference to `OpenSSL_version' ext/openssl/.libs/openssl.o: In function `zm_startup_openssl': /var/tmp_php/php-7.1.3/ext/openssl/openssl.c:1396: undefined reference to `OPENSSL_init_ssl' /var/tmp_php/php-7.1.3/ext/openssl/openssl.c:1397: undefined reference to `OPENSSL_init_crypto' /var/tmp_php/php-7.1.3/ext/openssl/openssl.c:1398: undefined reference to `OPENSSL_init_crypto' /var/tmp_php/php-7.1.3/ext/openssl/openssl.c:1399: undefined reference to `OPENSSL_init_crypto' /var/tmp_php/php-7.1.3/ext/openssl/openssl.c:1407: undefined reference to `OPENSSL_init_ssl' ext/openssl/.libs/openssl.o: In function `zif_openssl_decrypt': /var/tmp_php/php-7.1.3/ext/openssl/openssl.c:6513: undefined reference to `EVP_CIPHER_CTX_reset' ext/openssl/.libs/openssl.o: In function `zif_openssl_encrypt': /var/tmp_php/php-7.1.3/ext/openssl/openssl.c:6426: undefined reference to `EVP_CIPHER_CTX_reset' ext/openssl/.libs/openssl.o: In function `zif_openssl_digest': /var/tmp_php/php-7.1.3/ext/openssl/openssl.c:6111: undefined reference to `EVP_MD_CTX_new' /var/tmp_php/php-7.1.3/ext/openssl/openssl.c:6134: undefined reference to `EVP_MD_CTX_free' ext/openssl/.libs/openssl.o: In function `zif_openssl_dh_compute_key': /var/tmp_php/php-7.1.3/ext/openssl/openssl.c:4838: undefined reference to `EVP_PKEY_get0_DH' ext/openssl/.libs/openssl.o: In function `zif_openssl_pkey_get_details': /var/tmp_php/php-7.1.3/ext/openssl/openssl.c:4750: undefined reference to `EVP_PKEY_get0_EC_KEY' /var/tmp_php/php-7.1.3/ext/openssl/openssl.c:4759: undefined reference to `EVP_PKEY_get0_EC_KEY' /var/tmp_php/php-7.1.3/ext/openssl/openssl.c:4677: undefined reference to `EVP_PKEY_get0_RSA' /var/tmp_php/php-7.1.3/ext/openssl/openssl.c:4684: undefined reference to `RSA_get0_key' /var/tmp_php/php-7.1.3/ext/openssl/openssl.c:4685: undefined reference to `RSA_get0_factors' /var/tmp_php/php-7.1.3/ext/openssl/openssl.c:4686: undefined reference to `RSA_get0_crt_params' /var/tmp_php/php-7.1.3/ext/openssl/openssl.c:4728: undefined reference to `EVP_PKEY_get0_DH' /var/tmp_php/php-7.1.3/ext/openssl/openssl.c:4735: undefined reference to `DH_get0_pqg' /var/tmp_php/php-7.1.3/ext/openssl/openssl.c:4736: undefined reference to `DH_get0_key' /var/tmp_php/php-7.1.3/ext/openssl/openssl.c:4706: undefined reference to `EVP_PKEY_get0_DSA' /var/tmp_php/php-7.1.3/ext/openssl/openssl.c:4713: undefined reference to `DSA_get0_pqg' /var/tmp_php/php-7.1.3/ext/openssl/openssl.c:4714: undefined reference to `DSA_get0_key' /var/tmp_php/php-7.1.3/ext/openssl/openssl.c:4795: undefined reference to `EVP_PKEY_get0_EC_KEY' ext/openssl/.libs/openssl.o: In function `php_openssl_pkey_init_dh': /var/tmp_php/php-7.1.3/ext/openssl/openssl.c:4180: undefined reference to `DH_set0_pqg' ext/openssl/.libs/openssl.o: In function `php_openssl_dh_pub_from_priv': /var/tmp_php/php-7.1.3/ext/openssl/openssl.c:4157: undefined reference to `BN_with_flags' ext/openssl/.libs/openssl.o: In function `php_openssl_pkey_init_dh': /var/tmp_php/php-7.1.3/ext/openssl/openssl.c:4194: undefined reference to `DH_set0_key' /var/tmp_php/php-7.1.3/ext/openssl/openssl.c:4187: undefined reference to `DH_set0_key' ext/openssl/.libs/openssl.o: In function `php_openssl_pkey_init_dsa': /var/tmp_php/php-7.1.3/ext/openssl/openssl.c:4103: undefined reference to `DSA_set0_pqg' /var/tmp_php/php-7.1.3/ext/openssl/openssl.c:4110: undefined reference to `DSA_set0_key' /var/tmp_php/php-7.1.3/ext/openssl/openssl.c:4122: undefined reference to `DSA_get0_key' /var/tmp_php/php-7.1.3/ext/openssl/openssl.c:4123: undefined reference to `BN_is_zero' ext/openssl/.libs/openssl.o: In function `php_openssl_pkey_init_and_assign_rsa': /var/tmp_php/php-7.1.3/ext/openssl/openssl.c:4069: undefined reference to `RSA_set0_key' /var/tmp_php/php-7.1.3/ext/openssl/openssl.c:4082: undefined reference to `RSA_set0_crt_params' /var/tmp_php/php-7.1.3/ext/openssl/openssl.c:4075: undefined reference to `RSA_set0_factors' ext/openssl/.libs/openssl.o: In function `sk_X509_num': /usr/local/include/openssl/x509.h:97: undefined reference to `OPENSSL_sk_num' /usr/local/include/openssl/x509.h:97: undefined reference to `OPENSSL_sk_num' ext/openssl/.libs/openssl.o: In function `sk_X509_pop': /usr/local/include/openssl/x509.h:97: undefined reference to `OPENSSL_sk_pop' ext/openssl/.libs/openssl.o: In function `sk_X509_free': /usr/local/include/openssl/x509.h:97: undefined reference to `OPENSSL_sk_free' ext/openssl/.libs/openssl.o: In function `sk_X509_new_null': /usr/local/include/openssl/x509.h:97: undefined reference to `OPENSSL_sk_new_null' ext/openssl/.libs/openssl.o: In function `sk_X509_push': /usr/local/include/openssl/x509.h:97: undefined reference to `OPENSSL_sk_push' /usr/local/include/openssl/x509.h:97: undefined reference to `OPENSSL_sk_push' ext/openssl/.libs/openssl.o: In function `zif_openssl_x509_parse': /var/tmp_php/php-7.1.3/ext/openssl/openssl.c:2307: undefined reference to `X509_get_version' /var/tmp_php/php-7.1.3/ext/openssl/openssl.c:2334: undefined reference to `X509_getm_notBefore' /var/tmp_php/php-7.1.3/ext/openssl/openssl.c:2335: undefined reference to `X509_getm_notAfter' /var/tmp_php/php-7.1.3/ext/openssl/openssl.c:2337: undefined reference to `X509_getm_notBefore' /var/tmp_php/php-7.1.3/ext/openssl/openssl.c:2338: undefined reference to `X509_getm_notAfter' /var/tmp_php/php-7.1.3/ext/openssl/openssl.c:2345: undefined reference to `X509_get_signature_nid' ext/openssl/.libs/openssl.o: In function `sk_GENERAL_NAME_pop_free': /usr/local/include/openssl/x509v3.h:165: undefined reference to `OPENSSL_sk_pop_free' ext/openssl/.libs/openssl.o: In function `sk_GENERAL_NAME_num': /usr/local/include/openssl/x509v3.h:165: undefined reference to `OPENSSL_sk_num' ext/openssl/.libs/openssl.o: In function `sk_GENERAL_NAME_value': /usr/local/include/openssl/x509v3.h:165: undefined reference to `OPENSSL_sk_value' ext/openssl/.libs/openssl.o: In function `sk_X509_new_null': /usr/local/include/openssl/x509.h:97: undefined reference to `OPENSSL_sk_new_null' ext/openssl/.libs/openssl.o: In function `sk_X509_INFO_shift': /usr/local/include/openssl/x509.h:252: undefined reference to `OPENSSL_sk_shift' ext/openssl/.libs/openssl.o: In function `sk_X509_push': /usr/local/include/openssl/x509.h:97: undefined reference to `OPENSSL_sk_push' ext/openssl/.libs/openssl.o: In function `sk_X509_INFO_num': /usr/local/include/openssl/x509.h:252: undefined reference to `OPENSSL_sk_num' ext/openssl/.libs/openssl.o: In function `sk_X509_num': /usr/local/include/openssl/x509.h:97: undefined reference to `OPENSSL_sk_num' ext/openssl/.libs/openssl.o: In function `sk_X509_INFO_free': /usr/local/include/openssl/x509.h:252: undefined reference to `OPENSSL_sk_free' ext/openssl/.libs/openssl.o: In function `sk_X509_free': /usr/local/include/openssl/x509.h:97: undefined reference to `OPENSSL_sk_free' /usr/local/include/openssl/x509.h:97: undefined reference to `OPENSSL_sk_free' /usr/local/include/openssl/x509.h:97: undefined reference to `OPENSSL_sk_free' ext/openssl/.libs/openssl.o: In function `sk_X509_pop_free': /usr/local/include/openssl/x509.h:97: undefined reference to `OPENSSL_sk_pop_free' ext/openssl/.libs/openssl.o: In function `sk_CONF_VALUE_num': /usr/local/include/openssl/conf.h:31: undefined reference to `OPENSSL_sk_num' ext/openssl/.libs/openssl.o: In function `sk_CONF_VALUE_value': /usr/local/include/openssl/conf.h:31: undefined reference to `OPENSSL_sk_value' ext/openssl/.libs/openssl.o: In function `php_openssl_is_private_key': /var/tmp_php/php-7.1.3/ext/openssl/openssl.c:3985: undefined reference to `EVP_PKEY_get0_DSA' /var/tmp_php/php-7.1.3/ext/openssl/openssl.c:3989: undefined reference to `DSA_get0_pqg' /var/tmp_php/php-7.1.3/ext/openssl/openssl.c:3994: undefined reference to `DSA_get0_key' /var/tmp_php/php-7.1.3/ext/openssl/openssl.c:3968: undefined reference to `EVP_PKEY_get0_RSA' /var/tmp_php/php-7.1.3/ext/openssl/openssl.c:3972: undefined reference to `RSA_get0_factors' /var/tmp_php/php-7.1.3/ext/openssl/openssl.c:4003: undefined reference to `EVP_PKEY_get0_DH' /var/tmp_php/php-7.1.3/ext/openssl/openssl.c:4007: undefined reference to `DH_get0_pqg' /var/tmp_php/php-7.1.3/ext/openssl/openssl.c:4012: undefined reference to `DH_get0_key' /var/tmp_php/php-7.1.3/ext/openssl/openssl.c:4022: undefined reference to `EVP_PKEY_get0_EC_KEY' ext/openssl/.libs/openssl.o: In function `zif_openssl_seal': /var/tmp_php/php-7.1.3/ext/openssl/openssl.c:5879: undefined reference to `EVP_CIPHER_CTX_reset' ext/openssl/.libs/openssl.o: In function `zif_openssl_verify': /var/tmp_php/php-7.1.3/ext/openssl/openssl.c:5785: undefined reference to `EVP_MD_CTX_new' /var/tmp_php/php-7.1.3/ext/openssl/openssl.c:5792: undefined reference to `EVP_MD_CTX_free' ext/openssl/.libs/openssl.o: In function `zif_openssl_sign': /var/tmp_php/php-7.1.3/ext/openssl/openssl.c:5718: undefined reference to `EVP_MD_CTX_new' /var/tmp_php/php-7.1.3/ext/openssl/openssl.c:5733: undefined reference to `EVP_MD_CTX_free' ext/openssl/.libs/openssl.o: In function `zif_openssl_public_decrypt': /var/tmp_php/php-7.1.3/ext/openssl/openssl.c:5610: undefined reference to `EVP_PKEY_get0_RSA' ext/openssl/.libs/openssl.o: In function `zif_openssl_public_encrypt': /var/tmp_php/php-7.1.3/ext/openssl/openssl.c:5547: undefined reference to `EVP_PKEY_get0_RSA' ext/openssl/.libs/openssl.o: In function `zif_openssl_private_decrypt': /var/tmp_php/php-7.1.3/ext/openssl/openssl.c:5479: undefined reference to `EVP_PKEY_get0_RSA' ext/openssl/.libs/openssl.o: In function `zif_openssl_private_encrypt': /var/tmp_php/php-7.1.3/ext/openssl/openssl.c:5417: undefined reference to `EVP_PKEY_get0_RSA' ext/openssl/.libs/openssl.o: In function `zif_openssl_pkey_export': /var/tmp_php/php-7.1.3/ext/openssl/openssl.c:4547: undefined reference to `EVP_PKEY_get0_EC_KEY' ext/openssl/.libs/openssl.o: In function `zif_openssl_pkey_export_to_file': /var/tmp_php/php-7.1.3/ext/openssl/openssl.c:4473: undefined reference to `EVP_PKEY_get0_EC_KEY' ext/openssl/.libs/openssl.o: In function `php_openssl_make_REQ': /var/tmp_php/php-7.1.3/ext/openssl/openssl.c:3045: undefined reference to `X509_REQ_get_subject_name' ext/openssl/.libs/openssl.o: In function `sk_CONF_VALUE_num': /usr/local/include/openssl/conf.h:31: undefined reference to `OPENSSL_sk_num' ext/openssl/.libs/openssl.o: In function `sk_CONF_VALUE_value': /usr/local/include/openssl/conf.h:31: undefined reference to `OPENSSL_sk_value' ext/openssl/.libs/openssl.o: In function `sk_CONF_VALUE_num': /usr/local/include/openssl/conf.h:31: undefined reference to `OPENSSL_sk_num' /usr/local/include/openssl/conf.h:31: undefined reference to `OPENSSL_sk_num' ext/openssl/.libs/openssl.o: In function `sk_CONF_VALUE_value': /usr/local/include/openssl/conf.h:31: undefined reference to `OPENSSL_sk_value' ext/openssl/.libs/openssl.o: In function `sk_X509_new_null': /usr/local/include/openssl/x509.h:97: undefined reference to `OPENSSL_sk_new_null' ext/openssl/.libs/openssl.o: In function `sk_X509_push': /usr/local/include/openssl/x509.h:97: undefined reference to `OPENSSL_sk_push' /usr/local/include/openssl/x509.h:97: undefined reference to `OPENSSL_sk_push' ext/openssl/.libs/openssl.o: In function `sk_X509_pop_free': /usr/local/include/openssl/x509.h:97: undefined reference to `OPENSSL_sk_pop_free' /usr/local/include/openssl/x509.h:97: undefined reference to `OPENSSL_sk_pop_free' ext/openssl/.libs/openssl.o: In function `zif_openssl_csr_get_subject': /var/tmp_php/php-7.1.3/ext/openssl/openssl.c:3575: undefined reference to `X509_REQ_get_subject_name' ext/openssl/.libs/openssl.o: In function `zif_openssl_csr_sign': /var/tmp_php/php-7.1.3/ext/openssl/openssl.c:3406: undefined reference to `X509_REQ_get_subject_name' /var/tmp_php/php-7.1.3/ext/openssl/openssl.c:3415: undefined reference to `X509_getm_notBefore' /var/tmp_php/php-7.1.3/ext/openssl/openssl.c:3416: undefined reference to `X509_getm_notAfter' ext/openssl/.libs/openssl.o: In function `sk_X509_value': /usr/local/include/openssl/x509.h:97: undefined reference to `OPENSSL_sk_value' ext/openssl/.libs/openssl.o: In function `sk_X509_num': /usr/local/include/openssl/x509.h:97: undefined reference to `OPENSSL_sk_num' ext/openssl/.libs/openssl.o: In function `sk_X509_free': /usr/local/include/openssl/x509.h:97: undefined reference to `OPENSSL_sk_free' /usr/local/include/openssl/x509.h:97: undefined reference to `OPENSSL_sk_free' /usr/local/include/openssl/x509.h:97: undefined reference to `OPENSSL_sk_free' ext/openssl/.libs/xp_ssl.o: In function `sk_X509_num': /usr/local/include/openssl/x509.h:97: undefined reference to `OPENSSL_sk_num' ext/openssl/.libs/xp_ssl.o: In function `sk_X509_value': /usr/local/include/openssl/x509.h:97: undefined reference to `OPENSSL_sk_value' ext/openssl/.libs/xp_ssl.o: In function `sk_X509_num': /usr/local/include/openssl/x509.h:97: undefined reference to `OPENSSL_sk_num' ext/openssl/.libs/xp_ssl.o: In function `set_server_specific_opts': /var/tmp_php/php-7.1.3/ext/openssl/xp_ssl.c:1241: undefined reference to `SSL_CTX_get_options' /var/tmp_php/php-7.1.3/ext/openssl/xp_ssl.c:1268: undefined reference to `SSL_CTX_set_options' ext/openssl/.libs/xp_ssl.o: In function `enable_server_sni': /var/tmp_php/php-7.1.3/ext/openssl/xp_ssl.c:1359: undefined reference to `TLS_server_method' ext/openssl/.libs/xp_ssl.o: In function `php_openssl_setup_crypto': /var/tmp_php/php-7.1.3/ext/openssl/xp_ssl.c:1512: undefined reference to `TLS_client_method' /var/tmp_php/php-7.1.3/ext/openssl/xp_ssl.c:1579: undefined reference to `SSL_CTX_set_alpn_select_cb' /var/tmp_php/php-7.1.3/ext/openssl/xp_ssl.c:1594: undefined reference to `SSL_CTX_set_options' /var/tmp_php/php-7.1.3/ext/openssl/xp_ssl.c:1512: undefined reference to `TLS_server_method' /var/tmp_php/php-7.1.3/ext/openssl/xp_ssl.c:1574: undefined reference to `SSL_CTX_set_alpn_protos' ext/openssl/.libs/xp_ssl.o: In function `php_openssl_sockop_set_option': /var/tmp_php/php-7.1.3/ext/openssl/xp_ssl.c:2289: undefined reference to `SSL_get0_alpn_selected' ext/openssl/.libs/xp_ssl.o: In function `sk_GENERAL_NAME_num': /usr/local/include/openssl/x509v3.h:165: undefined reference to `OPENSSL_sk_num' ext/openssl/.libs/xp_ssl.o: In function `sk_GENERAL_NAME_value': /usr/local/include/openssl/x509v3.h:165: undefined reference to `OPENSSL_sk_value' ext/phar/.libs/util.o: In function `phar_create_signature': /var/tmp_php/php-7.1.3/ext/phar/util.c:1860: undefined reference to `EVP_MD_CTX_new' /var/tmp_php/php-7.1.3/ext/phar/util.c:1892: undefined reference to `EVP_MD_CTX_free' ext/phar/.libs/util.o: In function `phar_verify_signature': /var/tmp_php/php-7.1.3/ext/phar/util.c:1563: undefined reference to `EVP_MD_CTX_new' /var/tmp_php/php-7.1.3/ext/phar/util.c:1595: undefined reference to `EVP_MD_CTX_free' /var/tmp_php/php-7.1.3/ext/phar/util.c:1586: undefined reference to `EVP_MD_CTX_free' collect2: ld returned 1 exit status make: *** [sapi/cli/php] Error 1