Re: storage size of 'buf' isn't known - Slackware

From: Date: Wed, 08 Aug 2001 06:57:32 +0000
Subject: Re: storage size of 'buf' isn't known - Slackware
References: 1  Groups: php.install 
Request: Send a blank email to php-install+get-3892@lists.php.net to get a copy of this message
Anybody have any idea what the problem is here? David Schanen wrote: > This is an older version of Slackware: > Linux www 2.0.33 #1 Tue Apr 7 20:12:12 PDT 1998 i586 unknown > > Anyone have an idea what I can do to fix this? > > /bin/sh /usr/local/src/php-4.0.6/libtool --silent --mode=compile gcc > -I. -I/usr/local/src/php-4.0.6/ext/standard > -I/usr/local/src/php-4.0.6/main -I/usr/local/src/php-4.0.6 > -I/usr/local/apache/include -I/usr/local/src/php-4.0.6/Zend > -I/usr/local/src/php-4.0.6/ext/mysql/libmysql > -I/usr/local/src/php-4.0.6/ext/xml/expat/xmltok > -I/usr/local/src/php-4.0.6/ext/xml/expat/xmlparse > -I/usr/local/src/php-4.0.6/TSRM -DLINUX=20 -DUSE_HSREGEX -DUSE_EXPAT > -DNO_DL_NEEDED -DSUPPORT_UTF8 -DXML_BYTE_ORDER=12 -g -O2 -c filestat.c > filestat.c: In function `php_if_diskfreespace': > filestat.c:157: storage size of `buf' isn't known > make[3]: *** [filestat.lo] Error 1 > make[3]: Leaving directory `/usr/local/src/php-4.0.6/ext/standard' > make[2]: *** [all-recursive] Error 1 > make[2]: Leaving directory `/usr/local/src/php-4.0.6/ext/standard' > make[1]: *** [all-recursive] Error 1 > make[1]: Leaving directory `/usr/local/src/php-4.0.6/ext' > make: *** [all-recursive] Error 1

« previous php.install (#3892) next »