CVS compile issues

From: Date: Wed, 15 Aug 2001 01:03:28 +0000
Subject: CVS compile issues
Groups: php.install 
Request: Send a blank email to php-install+get-3977@lists.php.net to get a copy of this message
I'm trying to compile the latest CVS for use with PHP-GTK CVS. ./configure is fine, but here is the last few lines of make expat -I/usr/local/cvs/php4/TSRM -g -O2 -c basic_functions.c && touch basic_functions.lo basic_functions.c: In function `zif_is_numeric': basic_functions.c:1476: too many arguments to function `is_numeric_string' make[3]: *** [basic_functions.lo] Error 1 make[3]: Leaving directory `/usr/local/cvs/php4/ext/standard' make[2]: *** [all-recursive] Error 1 make[2]: Leaving directory `/usr/local/cvs/php4/ext/standard' make[1]: *** [all-recursive] Error 1 make[1]: Leaving directory `/usr/local/cvs/php4/ext' make: *** [all-recursive] Error 1 I don't have any options on ./configure. Please send any replies to evan@coeus-group.com- I don't subscribe to this list, only php-general Thanks in advance

« previous php.install (#3977) next »