Php4.1.0 make in Solaris 8 error !

From: Date: Tue, 08 Jan 2002 12:26:03 +0000
Subject: Php4.1.0 make in Solaris 8 error !
Groups: php.install 
Request: Send a blank email to php-install+get-5512@lists.php.net to get a copy of this message
Hi,every one! When I run "make", I get errors like this : # #make Mking all in Zend make[1]: Entering directory `/usr/share/src/php-4.0.6/Zend' /bin/sh ../libtool --silent --mode=compile gcc -DHAVE_CONFIG_H -I. -I. -I../main -D_POSIX_PTHREAD_SEMANTICS -DSUPPORT_UTF8 -DXML_BYTE_ORDER=21 -g -O2 -c zend_ language_scanner.c /usr/ccs/bin/as: "/var/tmp/ccy20dHk.s", line 29507: error: unknown opcode ".subs ection" /usr/ccs/bin/as: "/var/tmp/ccy20dHk.s", line 29507: error: statement syntax /usr/ccs/bin/as: "/var/tmp/ccy20dHk.s", line 29665: error: unknown opcode ".prev i ous" /usr/ccs/bin/as: "/var/tmp/ccy20dHk.s", line 29665: error: statement syntax make[1]: *** [zend_language_scanner.lo] Error 1 make[1]: Leaving directory `/usr/share/src/php-4.0.6/Zend' make: *** [all-recursive] Error 1 #

« previous php.install (#5512) next »