Apache Make

From: Date: Tue, 19 Mar 2002 15:26:10 +0000
Subject: Apache Make
Groups: php.install 
Request: Send a blank email to php-install+get-6411@lists.php.net to get a copy of this message
Having problems compiling httpd with php4 module activated. I am using PHP 4.1.2, Apache 1.3.22 and MySQL 3.23.49a on Linux Red Hat 6.0. Error reads, -o httpd buildmark.o modules.o modules/standard/libstandard.a modules/php4/libphp4.a main/libmain.a ./os/unix/libos.a ap/libap.a lib/expat-lite/libexpat.a -Wl,-rpath,/home/mandrews/source/mysql3.23.49a/lib -rdynamic -L/home/mandrews/source/mysql3.23.49a/lib -Lmodules/php4 -L../modules/php4 -L../../modules/php4 -lmodphp4 -lpam -ldl -lmysqlclient -lcrypt -lresolv -lm -ldl -lnsl -lresolv -lcrypt -lm -lcrypt /home/mandrews/source/mysql3.23.49a/lib/libmysqlclient.a(my_compress.o): In function `my_uncompress': my_compress.o(.text+0xa2): undefined reference to `uncompress' /home/mandrews/source/mysql3.23.49a/lib/libmysqlclient.a(my_compress.o): In function `my_compress_alloc': my_compress.o(.text+0x13a): undefined reference to `compress' collect2: ld returned 1 exit status make[2]: *** [target_static] Error 1 make[2]: Leaving directory `/home/mandrews/source/apache_1.3.22/src' make[1]: *** [build-std] Error 2 make[1]: Leaving directory `/home/mandrews/source/apache_1.3.22' make: *** [build] Error 2

« previous php.install (#6411) next »