Re: php 4.1.2 & Apache 2

From: Date: Sun, 07 Apr 2002 00:52:16 +0000
Subject: Re: php 4.1.2 & Apache 2
References: 1  Groups: php.install 
Request: Send a blank email to php-install+get-6574@lists.php.net to get a copy of this message
Under Linux kernel 2.4.18 with gcc 3.0.4, php 4.1.2 compiles OK for Apache 1.3.24, using --with-apxs, but attempting to compile for Apache 2.0.35, using --with-apxs2, produces the following error messages: make[3]: Entering directory `/opt/src/apache/php-4.1.2/sapi/apache2filter' /bin/sh /opt/src/apache/php-4.1.2/libtool --silent --mode=compile /opt/src/apache/php-4.1.2/meta_ccld -I. -I/opt/src/apache/php-4.1.2/sapi/ap ache2filter -I/opt/src/apache/php-4.1.2/main -I/opt/src/apache/php-4.1.2 -I/ srv/apache2/include -I/opt/src/apache/php-4.1.2/Zend -I/opt/db-3.3.11/includ e -I/usr/local/include -I/opt/src/apache/imap/include -I/opt/include -I/usr/ include/mysql -I/opt/src/apache/php-4.1.2/ext/xml/expat -D_REENTRANT -I/opt /src/apache/php-4.1.2/TSRM -pthread -DZTS -prefer-pic -c sapi_apache2.c sapi_apache2.c: In function `php_apache_sapi_ub_write': sapi_apache2.c:58: too few arguments to function `apr_brigade_create' sapi_apache2.c:61: too few arguments to function `apr_bucket_transient_create' sapi_apache2.c: In function `php_apache_sapi_register_variables': sapi_apache2.c:148: warning: initialization discards qualifiers from pointer target type sapi_apache2.c: In function `php_apache_sapi_flush': sapi_apache2.c:171: too few arguments to function `apr_brigade_create' sapi_apache2.c:172: too few arguments to function `apr_bucket_flush_create' sapi_apache2.c: In function `php_input_filter': sapi_apache2.c:245: too few arguments to function `apr_brigade_create' sapi_apache2.c:247: incompatible type for argument 4 of `ap_get_brigade' sapi_apache2.c:247: too few arguments to function `ap_get_brigade' sapi_apache2.c: In function `php_output_filter': sapi_apache2.c:311: too few arguments to function `apr_brigade_create' sapi_apache2.c:366: too few arguments to function `apr_bucket_transient_create' sapi_apache2.c:375: too few arguments to function `apr_bucket_eos_create' sapi_apache2.c: In function `php_register_hook': sapi_apache2.c:407: `AP_FTYPE_CONTENT' undeclared (first use in this function) sapi_apache2.c:407: (Each undeclared identifier is reported only once sapi_apache2.c:407: for each function it appears in.) sapi_apache2.c:408: warning: passing arg 2 of `ap_register_input_filter' from incompatible pointer type make[3]: *** [sapi_apache2.lo] Error 1 make[3]: Leaving directory `/opt/src/apache/php-4.1.2/sapi/apache2filter' make[2]: *** [all-recursive] Error 1 make[2]: Leaving directory `/opt/src/apache/php-4.1.2/sapi/apache2filter' make[1]: *** [all-recursive] Error 1 make[1]: Leaving directory `/opt/src/apache/php-4.1.2/sapi' make: *** [all-recursive] Error 1

« previous php.install (#6574) next »