Re: problem
| From: | Gabor Hojtsy | Date: | Fri, 12 Jul 2002 16:19:30 +0000 |
| Subject: | Re: problem | ||
| References: | 1 | Groups: | php.mirrors |
| Request: | Send a blank email to php-mirrors+get-11298@lists.php.net to get a copy of this message | ||
Sorry, but this email address is not the appropriate forum for asking
support questions. For a list of more appropriate places to
ask for help using PHP, please visit http://php.net/support
Thank you for your interest in PHP.
Goba [one webmaster@php.net]
----- Original Message -----
From: Somsak Pattanaprateep
To: webmaster@php.net
Sent: Friday, July 12, 2002 1:13 PM
Subject: problem
Dear sir
I try to install php-4.2.1 with apache-2.0.39 but It's not work. I follow instrucion in
file INSTALL. but when i make it have error occor that I keep error to show you
( I configure by command ./configure --with-mysql --with-apxs2=/www/bin/apxs )
thanks for suggestion
paokrab
/bin/sh /usr/apps/php-4.2.1/libtool --silent --mode=compile gcc -I.
-I/usr/apps/php-4.2.1/sapi/apache2filter -I/usr/apps/php-4.2.1/main -I/usr/apps/php-4.2.1
-I/www/include -I/usr/apps/php-4.2.1/Zend -I/usr/apps/php-4.2.1/ext/mysql/libmysql
-I/usr/apps/php-4.2.1/ext/xml/expat -D_REENTRANT -I/usr/apps/php-4.2.1/TSRM -DTHREAD=1 -g -O2
-pthread -DZTS -prefer-pic -c sapi_apache2.c
/bin/sh /usr/apps/php-4.2.1/libtool --silent --mode=compile gcc -I.
-I/usr/apps/php-4.2.1/sapi/apache2filter -I/usr/apps/php-4.2.1/main -I/usr/apps/php-4.2.1
-I/www/include -I/usr/apps/php-4.2.1/Zend -I/usr/apps/php-4.2.1/ext/mysql/libmysql
-I/usr/apps/php-4.2.1/ext/xml/expat -D_REENTRANT -I/usr/apps/php-4.2.1/TSRM -DTHREAD=1 -g -O2
-pthread -DZTS -prefer-pic -c apache_config.c
/bin/sh /usr/apps/php-4.2.1/libtool --silent --mode=compile gcc -I.
-I/usr/apps/php-4.2.1/sapi/apache2filter -I/usr/apps/php-4.2.1/main -I/usr/apps/php-4.2.1
-I/www/include -I/usr/apps/php-4.2.1/Zend -I/usr/apps/php-4.2.1/ext/mysql/libmysql
-I/usr/apps/php-4.2.1/ext/xml/expat -D_REENTRANT -I/usr/apps/php-4.2.1/TSRM -DTHREAD=1 -g -O2
-pthread -DZTS -prefer-pic -c php_functions.c
php_functions.c:93: parse error
make[3]: *** [php_functions.lo] Error 1
make[3]: Leaving directory `/usr/apps/php-4.2.1/sapi/apache2filter'
make[2]: *** [all-recursive] Error 1
make[2]: Leaving directory `/usr/apps/php-4.2.1/sapi/apache2filter'
make[1]: *** [all-recursive] Error 1
make[1]: Leaving directory `/usr/apps/php-4.2.1/sapi'
make: *** [all-recursive] Error 1