note 87797 deleted from install by danbrown
| From: | danbrown@php.net | Date: | Mon, 22 Dec 2008 18:10:57 +0000 |
| Subject: | note 87797 deleted from install by danbrown | ||
| References: | 1 | Groups: | php.notes |
| Request: | Send a blank email to php-notes+get-148458@lists.php.net to get a copy of this message | ||
Note Submitter: dieocom at hotmail dot com
----
I make on AIX 5.3 found this error
# make
/bin/sh /var/uppkg/php5.2-200812220330/libtool --silent --preserve-dup-deps --mode=compile gcc
-Iext/libxml/ -I/var/uppkg/php5.2-200812220330/ext/libxml/ -DPHP_ATOM_INC
-I/var/uppkg/php5.2-200812220330/include -I/var/uppkg/php5.2-200812220330/main
-I/var/uppkg/php5.2-200812220330 -I/usr/local/include/libxml2
-I/var/uppkg/php5.2-200812220330/ext/date/lib -I/usr/local/include/mysql
-I/var/uppkg/php5.2-200812220330/TSRM -I/var/uppkg/php5.2-200812220330/Zend -I/usr/include -g -O2
-c /var/uppkg/php5.2-200812220330/ext/libxml/libxml.c -o ext/libxml/libxml.lo
/bin/sh /var/uppkg/php5.2-200812220330/libtool --silent --preserve-dup-deps --mode=compile gcc
-I/var/uppkg/php5.2-200812220330/ext/pcre/pcrelib -Iext/pcre/
-I/var/uppkg/php5.2-200812220330/ext/pcre/ -DPHP_ATOM_INC -I/var/uppkg/php5.2-200812220330/include
-I/var/uppkg/php5.2-200812220330/main -I/var/uppkg/php5.2-200812220330 -I/usr/local/include/libxml2
-I/var/uppkg/php5.2-200812220330/ext/date/lib -I/usr/local/include/mysql
-I/var/uppkg/php5.2-200812220330/TSRM -I/var/uppkg/php5.2-200812220330/Zend -I/usr/include -g -O2
-c /var/uppkg/php5.2-200812220330/ext/pcre/pcrelib/pcre_chartables.c -o
ext/pcre/pcrelib/pcre_chartables.lo
In file included from /var/uppkg/php5.2-200812220330/ext/pcre/pcrelib/pcre_chartables.c:25:
/var/uppkg/php5.2-200812220330/ext/pcre/pcrelib/pcre_internal.h:976: error: expected
specifier-qualifier-list before 'BOOL'
/var/uppkg/php5.2-200812220330/ext/pcre/pcrelib/pcre_internal.h:1027: error: expected
specifier-qualifier-list before 'BOOL'
/var/uppkg/php5.2-200812220330/ext/pcre/pcrelib/pcre_internal.h:1137: error: expected '=',
',', ';', 'asm' or '__attribute__' before
'php__pcre_is_newline'
/var/uppkg/php5.2-200812220330/ext/pcre/pcrelib/pcre_internal.h:1143: error: expected '=',
',', ';', 'asm' or '__attribute__' before
'php__pcre_was_newline'
/var/uppkg/php5.2-200812220330/ext/pcre/pcrelib/pcre_internal.h:1145: error: expected '=',
',', ';', 'asm' or '__attribute__' before
'php__pcre_xclass'
make: *** [ext/pcre/pcrelib/pcre_chartables.lo] Error 1