note 88845 rejected from install by danbrown
| From: | danbrown@php.net | Date: | Tue, 10 Feb 2009 17:57:47 +0000 |
| Subject: | note 88845 rejected from install by danbrown | ||
| References: | 1 | Groups: | php.notes |
| Request: | Send a blank email to php-notes+get-150457@lists.php.net to get a copy of this message | ||
Note Submitter: me at michalscorner dot com
----
I got same error on AIX 5.3 TL5
/bin/sh /tmp/install/php/php-5.2.8/libtool --silent --preserve-dup-deps --mode=compile gcc
-Iext/libxml/ -I/tmp/install/php/php-5.2.8/ext/libxml/ -DPHP_ATOM_INC
-I/tmp/install/php/php-5.2.8/include -I/tmp/install/php/php-5.2.8/main -I/tmp/install/php/php-5.2.8
-I/opt/freeware/include/libxml2 -I/tmp/install/php/php-5.2.8/ext/date/lib
-I/tmp/install/php/php-5.2.8/TSRM -I/tmp/install/php/php-5.2.8/Zend -I/usr/include -g -O2 -c
/tmp/install/php/php-5.2.8/ext/libxml/libxml.c -o ext/libxml/libxml.lo
/bin/sh /tmp/install/php/php-5.2.8/libtool --silent --preserve-dup-deps --mode=compile gcc
-I/tmp/install/php/php-5.2.8/ext/pcre/pcrelib -Iext/pcre/ -I/tmp/install/php/php-5.2.8/ext/pcre/
-DPHP_ATOM_INC -I/tmp/install/php/php-5.2.8/include -I/tmp/install/php/php-5.2.8/main
-I/tmp/install/php/php-5.2.8 -I/opt/freeware/include/libxml2
-I/tmp/install/php/php-5.2.8/ext/date/lib -I/tmp/install/php/php-5.2.8/TSRM
-I/tmp/install/php/php-5.2.8/Zend -I/usr/include -g -O2 -c
/tmp/install/php/php-5.2.8/ext/pcre/pcrelib/pcre_chartables.c -o ext/pcre/pcrelib/pcre_chartables.lo
In file included from /tmp/install/php/php-5.2.8/ext/pcre/pcrelib/pcre_chartables.c:25:
/tmp/install/php/php-5.2.8/ext/pcre/pcrelib/pcre_internal.h:976: error: expected
specifier-qualifier-list before 'BOOL'
/tmp/install/php/php-5.2.8/ext/pcre/pcrelib/pcre_internal.h:1027: error: expected
specifier-qualifier-list before 'BOOL'
/tmp/install/php/php-5.2.8/ext/pcre/pcrelib/pcre_internal.h:1137: error: expected '=',
',', ';', 'asm' or '__attribute__' before
'php__pcre_is_newline'
/tmp/install/php/php-5.2.8/ext/pcre/pcrelib/pcre_internal.h:1143: error: expected '=',
',', ';', 'asm' or '__attribute__' before
'php__pcre_was_newline'
/tmp/install/php/php-5.2.8/ext/pcre/pcrelib/pcre_internal.h:1145: error: expected '=',
',', ';', 'asm' or '__attribute__' before
'php__pcre_xclass'
make: *** [ext/pcre/pcrelib/pcre_chartables.lo] Error 1
Could you please help ?