note 110849 deleted from bcompiler.setup by frozenfire

From: Date: Sat, 15 Dec 2012 01:41:08 +0000
Subject: note 110849 deleted from bcompiler.setup by frozenfire
References: 1  Groups: php.notes 
Request: Send a blank email to php-notes+get-192540@lists.php.net to get a copy of this message
Note Submitter: niconeo33 at free dot fr ---- Hi, I Use raspbmc with my raspberry and i would like install bcompiler but when I send "pecl install bcompiler" the make command doesn't work. Could you help me please ? root@raspbmc:~# pecl install bcompiler downloading bcompiler-1.0.2.tgz ... Starting to download bcompiler-1.0.2.tgz (57,347 bytes) ..............done: 57,347 bytes 11 source files, building running: phpize Configuring for: PHP Api Version: 20100412 Zend Module Api No: 20100525 Zend Extension Api No: 220100525 .... configure: creating ./config.status config.status: creating config.h config.status: executing libtool commands running: make /bin/bash /tmp/pear/temp/pear-build-rootNoHH38/bcompiler-1.0.2/libtool --mode=compile cc -I. -I/tmp/pear/temp/bcompiler -DPHP_ATOM_INC -I/tmp/pear/temp/pear-build-rootNoHH38/bcompiler-1.0.2/include -I/tmp/pear/temp/pear-build-rootNoHH38/bcompiler-1.0.2/main -I/tmp/pear/temp/bcompiler -I/usr/include/php5 -I/usr/include/php5/main -I/usr/include/php5/TSRM -I/usr/include/php5/Zend -I/usr/include/php5/ext -I/usr/include/php5/ext/date/lib -D_LARGEFILE_SOURCE -D_FILE_OFFSET_BITS=64 -DHAVE_CONFIG_H -g -O2 -c /tmp/pear/temp/bcompiler/php_bcompiler.c -o php_bcompiler.lo libtool: compile: cc -I. -I/tmp/pear/temp/bcompiler -DPHP_ATOM_INC -I/tmp/pear/temp/pear-build-rootNoHH38/bcompiler-1.0.2/include -I/tmp/pear/temp/pear-build-rootNoHH38/bcompiler-1.0.2/main -I/tmp/pear/temp/bcompiler -I/usr/include/php5 -I/usr/include/php5/main -I/usr/include/php5/TSRM -I/usr/include/php5/Zend -I/usr/include/php5/ext -I/usr/include/php5/ext/date/lib -D_LARGEFILE_SOURCE -D_FILE_OFFSET_BITS=64 -DHAVE_CONFIG_H -g -O2 -c /tmp/pear/temp/bcompiler/php_bcompiler.c -fPIC -DPIC -o .libs/php_bcompiler.o /tmp/pear/temp/bcompiler/php_bcompiler.c: In function '_bcompiler_write_functions_from_file': /tmp/pear/temp/bcompiler/php_bcompiler.c:468:6: warning: passing argument 1 of 'apc_serialize_zstring' discards 'const' qualifier from pointer target type [enabled by default] /tmp/pear/temp/bcompiler/php_bcompiler.h:298:6: note: expected 'char *' but argument is of type 'const char *' /tmp/pear/temp/bcompiler/php_bcompiler.c: In function 'zif_bcompiler_write_file': /tmp/pear/temp/bcompiler/php_bcompiler.c:574:10: error: 'zend_class_entry' has no member named 'filename' /tmp/pear/temp/bcompiler/php_bcompiler.c:574:24: error: 'zend_class_entry' has no member named 'filename' /tmp/pear/temp/bcompiler/php_bcompiler.c:574:24: error: 'zend_class_entry' has no member named 'filename' /tmp/pear/temp/bcompiler/php_bcompiler.c:574:24: error: 'zend_class_entry' has no member named 'filename' /tmp/pear/temp/bcompiler/php_bcompiler.c:574:24: error: 'zend_class_entry' has no member named 'filename' /tmp/pear/temp/bcompiler/php_bcompiler.c:574:24: error: 'zend_class_entry' has no member named 'filename' /tmp/pear/temp/bcompiler/php_bcompiler.c:574:24: error: 'zend_class_entry' has no member named 'filename' /tmp/pear/temp/bcompiler/php_bcompiler.c:574:24: error: 'zend_class_entry' has no member named 'filename' /tmp/pear/temp/bcompiler/php_bcompiler.c:581:5: warning: passing argument 4 of 'apc_serialize_zend_class_entry' discards 'const' qualifier from pointer target type [enabled by default] /tmp/pear/temp/bcompiler/php_bcompiler.h:305:6: note: expected 'char *' but argument is of type 'const char *' /tmp/pear/temp/bcompiler/php_bcompiler.c:635:10: error: 'zend_class_entry' has no member named 'filename' make: *** [php_bcompiler.lo] Error 1 ERROR: `make' failed

« previous php.notes (#192540) next »