note 20541 rejected from install.apache by sander
| From: | sander@php.net | Date: | Sun, 07 Apr 2002 11:19:16 +0000 |
| Subject: | note 20541 rejected from install.apache by sander | ||
| References: | 1 | Groups: | php.notes |
| Request: | Send a blank email to php-notes+get-28846@lists.php.net to get a copy of this message | ||
I get the following error during 'make', when I try to install with --apxs2 option. I
specified the full path to the apxs-script. i have tested it with php-4.1.2 and php-4.2.0RC1. both
versions show the same error.
does anybody know how to deal with this error?
/bin/sh /usr/local/src/php-4.2.0RC1/libtool --silent --mode=compile gcc -I.
-I/usr/local/src/php-4.2.0RC1/sapi/apache2filter -I/usr/local/src/php-4.2.0RC1/main
-I/usr/local/src/php-4.2.0RC1 -I/usr/local/apache/2.0.35/include -I/usr/local/src/php-4.2.0RC1/Zend
-I/usr/local/mysql/4.0.1-alpha/include/mysql -I/usr/local/src/php-4.2.0RC1/ext/xml/expat
-D_REENTRANT -I/usr/local/src/php-4.2.0RC1/TSRM -g -O2 -pthread -DZTS -prefer-pic -c sapi_apache2.c
sapi_apache2.c: In function `php_apache_sapi_ub_write':
sapi_apache2.c:58: too few arguments to function `apr_brigade_create'
sapi_apache2.c:61: too few arguments to function `apr_bucket_transient_create'
sapi_apache2.c: In function `php_apache_sapi_flush':
sapi_apache2.c:174: too few arguments to function `apr_brigade_create'
sapi_apache2.c:175: too few arguments to function `apr_bucket_flush_create'
sapi_apache2.c: In function `php_input_filter':
sapi_apache2.c:257: too few arguments to function `apr_brigade_create'
sapi_apache2.c: In function `php_output_filter':
sapi_apache2.c:331: too few arguments to function `apr_brigade_create'
sapi_apache2.c:386: too few arguments to function `apr_bucket_transient_create'
sapi_apache2.c:395: too few arguments to function `apr_bucket_eos_create'
make[3]: *** [sapi_apache2.lo] Error 1
make[3]: Leaving directory `/usr/local/src/php-4.2.0RC1/sapi/apache2filter'
make[2]: *** [all-recursive] Error 1
make[2]: Leaving directory `/usr/local/src/php-4.2.0RC1/sapi/apache2filter'
make[1]: *** [all-recursive] Error 1
make[1]: Leaving directory `/usr/local/src/php-4.2.0RC1/sapi'
make: *** [all-recursive] Error 1