note 20553 rejected from install.apache by sander

From: Date: Mon, 08 Apr 2002 17:15:02 +0000
Subject: note 20553 rejected from install.apache by sander
References: 1  Groups: php.notes 
Request: Send a blank email to php-notes+get-28972@lists.php.net to get a copy of this message
I use php4.1.2 with apache 2.0.35 ./configure --with-apxs2=/usr/local/apache2/bin/apxs make it show message , anyone can help me ? sapi_apache2.c: In function `php_apache_sapi_ub_write': sapi_apache2.c:58: too few arguments to function `apr_brigade_create' sapi_apache2.c:61: too few arguments to function `apr_bucket_transient_create' sapi_apache2.c: In function `php_apache_sapi_register_variables': sapi_apache2.c:148: warning: initialization discards qualifiers from pointer target type sapi_apache2.c: In function `php_apache_sapi_flush': sapi_apache2.c:171: too few arguments to function `apr_brigade_create' sapi_apache2.c:172: too few arguments to function `apr_bucket_flush_create' sapi_apache2.c: In function `php_input_filter': sapi_apache2.c:245: too few arguments to function `apr_brigade_create' sapi_apache2.c:247: incompatible type for argument 4 of `ap_get_brigade' sapi_apache2.c:247: too few arguments to function `ap_get_brigade' sapi_apache2.c: In function `php_output_filter': sapi_apache2.c:311: too few arguments to function `apr_brigade_create' sapi_apache2.c:366: too few arguments to function `apr_bucket_transient_create' sapi_apache2.c:375: too few arguments to function `apr_bucket_eos_create' sapi_apache2.c: In function `php_register_hook': sapi_apache2.c:407: `AP_FTYPE_CONTENT' undeclared (first use in this function) sapi_apache2.c:407: (Each undeclared identifier is reported only once sapi_apache2.c:407: for each function it appears in.) sapi_apache2.c:408: warning: passing arg 2 of `ap_register_input_filter' from incompatible pointer type make[3]: *** [sapi_apache2.lo] Error 1 make[3]: Leaving directory `/root/php-4.1.2/sapi/apache2filter' make[2]: *** [all-recursive] Error 1 make[2]: Leaving directory `/root/php-4.1.2/sapi/apache2filter' make[1]: *** [all-recursive] Error 1 make[1]: Leaving directory `/root/php-4.1.2/sapi' make: *** [all-recursive] Error 1

« previous php.notes (#28972) next »