note 20749 rejected from faq by sander
| From: | sander@php.net | Date: | Mon, 15 Apr 2002 16:45:49 +0000 |
| Subject: | note 20749 rejected from faq by sander | ||
| References: | 1 | Groups: | php.notes |
| Request: | Send a blank email to php-notes+get-29380@lists.php.net to get a copy of this message | ||
I get a error when I make apache with php_mod. now I had installed php4.1.2 and my configure command
is: $./configure --prefix=/usr/local/apache/ --activate-module=src/modules/php4/libphp4.a
$make
===> src
make[1]: Entering directory `/usr/src/tgz/apache_1.3.24'
make[2]: Entering directory `/usr/src/tgz/apache_1.3.24/src'
===> src/os/unix
gcc -c -I../../os/unix -I../../include -DLINUX=22 -I/usr/src/tgz/php-4.1.2
-I/usr/src/tgz/php-4.1.2/main -I/usr/src/tgz/php-4.1.2/main -I/usr/src/tgz/php-4.1.2/Zend
-I/usr/src/tgz/php-4.1.2/Zend -I/usr/src/tgz/php-4.1.2/TSRM -I/usr/src/tgz/php-4.1.2/TSRM
-I/usr/src/tgz/php-4.1.2 -DUSE_EXPAT -I../../lib/expat-lite -DNO_DL_NEEDED
../../apaci
os.c
gcc -c -I../../os/unix -I../../include -DLINUX=22 -I/usr/src/tgz/php-4.1.2
-I/usr/src/tgz/php-4.1.2/main -I/usr/src/tgz/php-4.1.2/main -I/usr/src/tgz/php-4.1.2/Zend
-I/usr/src/tgz/php-4.1.2/Zend -I/usr/src/tgz/php-4.1.2/TSRM -I/usr/src/tgz/php-4.1.2/TSRM
-I/usr/src/tgz/php-4.1.2 -DUSE_EXPAT -I../../lib/expat-lite -DNO_DL_NEEDED ../../apaci
os-inline.c
rm -f libos.a
ar cr libos.a os.o os-inline.o
ranlib libos.a
<=== src/os/unix
===> src/ap
gcc -c -I../os/unix -I../include -DLINUX=22 -I/usr/src/tgz/php-4.1.2
-I/usr/src/tgz/php-4.1.2/main -I/usr/src/tgz/php-4.1.2/main -I/usr/src/tgz/php-4.1.2/Zend
-I/usr/src/tgz/php-4.1.2/Zend -I/usr/src/tgz/php-4.1.2/TSRM -I/usr/src/tgz/php-4.1.2/TSRM
-I/usr/src/tgz/php-4.1.2 -DUSE_EXPAT -I../lib/expat-lite -DNO_DL_NEEDED ../apaci
ap_cpystrn.c
In file included from ../include/httpd.h:73,
from ap_cpystrn.c:59:
../include/ap_alloc.h:345: parse error before `*'
../include/ap_alloc.h:345: warning: data definition has no type or storage class
../include/ap_alloc.h:346: parse error before `regex_t'
In file included from ap_cpystrn.c:59:
../include/httpd.h:1063: parse error before `*'
../include/httpd.h:1065: parse error before `*'
../include/httpd.h:1068: parse error before `regmatch_t'
make[3]: *** [ap_cpystrn.o] Error 1
make[2]: *** [subdirs] Error 1
make[2]: Leaving directory `/usr/src/tgz/apache_1.3.24/src'
make[1]: *** [build-std] Error 2
make[1]: Leaving directory `/usr/src/tgz/apache_1.3.24'
make: *** [build] Error 2
how can I solve the problem.thank for help