RE: [PEAR] Re: cannot find phpize

From: Date: Fri, 02 Jul 2004 12:25:46 +0000
Subject: RE: [PEAR] Re: cannot find phpize
Groups: php.pear.general 
Request: Send a blank email to pear-general+get-13460@lists.php.net to get a copy of this message
Sorry, I was about to reply. I managed to install it like you said, installing the php4-dev package. However, when running "pear install radius" the 'make' returned an error (below). This was solved by installing the libssl-dev package (I found it somewhere in the internet). Thanks a lot anyway! Alex running: make /bin/sh /var/tmp/pear-build-root/radius-1.2.4/libtool --mode=compile gcc -I. -I/tmp/tmpQD3xtU/radius-1.2.4 -DPHP_ATOM_INC -I/var/tmp/pear-build-root/radius-1.2.4/include -I/var/tmp/pear-build-root/radius-1.2.4/main -I/tmp/tmpQD3xtU/radius-1.2.4 -I/usr/include/php4 -I/usr/include/php4/main -I/usr/include/php4/Zend -I/usr/include/php4/TSRM -DHAVE_CONFIG_H -g -O2 -prefer-pic -c /tmp/tmpQD3xtU/radius-1.2.4/radius.c -o radius.lo mkdir .libs gcc -I. -I/tmp/tmpQD3xtU/radius-1.2.4 -DPHP_ATOM_INC -I/var/tmp/pear-build-root/radius-1.2.4/include -I/var/tmp/pear-build-root/radius-1.2.4/main -I/tmp/tmpQD3xtU/radius-1.2.4 -I/usr/include/php4 -I/usr/include/php4/main -I/usr/include/php4/Zend -I/usr/include/php4/TSRM -DHAVE_CONFIG_H -g -O2 -c /tmp/tmpQD3xtU/radius-1.2.4/radius.c -fPIC -DPIC -o .libs/radius.o In file included from /tmp/tmpQD3xtU/radius-1.2.4/radius.c:40: /usr/include/php4/main/php_network.h:78:25: openssl/ssl.h: No such file or directory In file included from /tmp/tmpQD3xtU/radius-1.2.4/radius.c:40: /usr/include/php4/main/php_network.h:129: error: parse error before "SSL" /usr/include/php4/main/php_network.h:129: warning: no semicolon at end of struct or union /usr/include/php4/main/php_network.h:132: error: parse error before '}' token /usr/include/php4/main/php_network.h:162: error: parse error before "SSL_METHOD" make: *** [radius.lo] Error 1 `make' failed -----Original Message----- From: Michael Wallner [mailto:mike@php.net] Sent: vrijdag 2 juli 2004 14:07 To: pear-general@lists.php.net Subject: [PEAR] Re: cannot find phpize Hi A. Lopez, you wrote: > Sh: line 1: phpize: command not found > 'phpize' failed Did you install PHP as a package of your linux distribution? Then you should also install the php-dev package or whatever it's called. Regards, -- Michael - < mike(@)php.net >

« previous php.pear.general (#13460) next »