Bug #58390 [Opn->Csd]: Compile error
| From: | yohgaki@php.net | Date: | Tue, 15 Jul 2014 10:44:57 +0000 |
| Subject: | Bug #58390 [Opn->Csd]: Compile error | ||
| References: | 1 | Groups: | php.pecl.dev |
| Request: | Send a blank email to pecl-dev+get-12042@lists.php.net to get a copy of this message | ||
Edit report at https://bugs.php.net/bug.php?id=58390&edit=1
ID: 58390
Updated by: yohgaki@php.net
Reported by: Nippon_cha_cha_cha at np dot yi dot org
Summary: Compile error
-Status: Open
+Status: Closed
Type: Bug
-Package: Fileinfo
+Package: PECL
Operating System: Slac-based linux
PHP Version: 5.2.5
-Assigned To:
+Assigned To: yohgaki
Block user comment: N
Private report: N
New Comment:
I suppose this could be closed now.
Previous Comments:
------------------------------------------------------------------------
[2008-10-25 02:42:44] Nippon_cha_cha_cha at np dot yi dot org
Description:
------------
PHP-5.2.6
GCC 3.4.3
GLIB 2.36
reating libtool
appending configuration tag "CXX" to libtool
configure: creating ./config.status
config.status: creating config.h
running: make
/bin/sh /var/tmp/pear-build-root/Fileinfo-1.0.4/libtool --mode=compile gcc -I.
-I/tmp/pear/download/Fileinfo-1.0.4 -DPHP_ATOM_INC -I/var/tmp/pear-build-root/Fi
leinfo-1.0.4/include -I/var/tmp/pear-build-root/Fileinfo-1.0.4/main -I/tmp/pear/
download/Fileinfo-1.0.4 -I/usr/local/include/php -I/usr/local/include/php/main -
I/usr/local/include/php/TSRM -I/usr/local/include/php/Zend -I/usr/local/include/
php/ext -I/usr/local/include/php/ext/date/lib -DHAVE_CONFIG_H -g -O2 -c /tmp
/pear/download/Fileinfo-1.0.4/fileinfo.c -o fileinfo.lo
mkdir .libs
gcc -I. -I/tmp/pear/download/Fileinfo-1.0.4 -DPHP_ATOM_INC -I/var/tmp/pear-buil
d-root/Fileinfo-1.0.4/include -I/var/tmp/pear-build-root/Fileinfo-1.0.4/main -I/
tmp/pear/download/Fileinfo-1.0.4 -I/usr/local/include/php -I/usr/local/include/p
hp/main -I/usr/local/include/php/TSRM -I/usr/local/include/php/Zend -I/usr/local
/include/php/ext -I/usr/local/include/php/ext/date/lib -DHAVE_CONFIG_H -g -O2 -c
/tmp/pear/download/Fileinfo-1.0.4/fileinfo.c -fPIC -DPIC -o .libs/fileinfo.o
/tmp/pear/download/Fileinfo-1.0.4/fileinfo.c: In function `zif_finfo_set_flags':
/tmp/pear/download/Fileinfo-1.0.4/fileinfo.c:339: error: void value not ignored
as it ought to be
/tmp/pear/download/Fileinfo-1.0.4/fileinfo.c: In function `_php_finfo_get_type':
/tmp/pear/download/Fileinfo-1.0.4/fileinfo.c:369: error: void value not ignored
as it ought to be
/tmp/pear/download/Fileinfo-1.0.4/fileinfo.c:413: error: void value not ignored
as it ought to be
make: *** [fileinfo.lo] Error 1
ERROR: `make' failed
Actual result:
--------------
------------------------------------------------------------------------
--
Edit this bug report at https://bugs.php.net/bug.php?id=58390&edit=1