Compiling ibm_db2

From: Date: Fri, 30 Sep 2005 20:34:04 +0000
Subject: Compiling ibm_db2
Groups: php.pecl.dev 
Request: Send a blank email to pecl-dev+get-3034@lists.php.net to get a copy of this message
Hey all-- I'm sure I'm just missing something here, but I can't seem to find any documentation on the base levels of db2, etc, and other requirements for compiling ibm_db2. I rather suspect this is something simple I'm overlooking (or am just not aware needs to be done/installed). I'm running a Linux (x86, fedora core 4) with IBM db2 v8.1 application development client (no fixpacks) installed. PHP is the stock package (with -devel, etc, all installed): php-5.0.4-10.4 Running "pear install ibm_db2" and feeding it the contents of $DB2DIR (/opt/IBM/db2/V8.1), I get... (complete output follows) [root@twink ~]# pear install ibm_db2 PHP Warning: PHP Startup: Unable to load dynamic library '/usr/lib/php/modules/mailparse.so' - /usr/lib/php/modules/mailparse.so: undefined symbol: mbfl_convert_filter_new in Unknown on line 0 downloading ibm_db2-1.1.2.tgz ... Starting to download ibm_db2-1.1.2.tgz (114,764 bytes) .........................done: 114,764 bytes 4 source files, building running: phpize Configuring for: PHP Api Version: 20031224 Zend Module Api No: 20041030 Zend Extension Api No: 220040412 /usr/share/aclocal/linc.m4:1: warning: underquoted definition of AM_PATH_LINC run info '(automake)Extending aclocal' or see http://sources.redhat.com/automake/automake.html#Extending-aclocal /usr/share/aclocal/libole2.m4:18: warning: underquoted definition of AM_PATH_LIBOLE2 /usr/share/aclocal/libmcrypt.m4:17: warning: underquoted definition of AM_PATH_LIBMCRYPT /usr/share/aclocal/ao.m4:9: warning: underquoted definition of XIPH_PATH_AO DB2 Installation Directory? : /opt/IBM/db2/V8.1 building in /var/tmp/pear-build-root/ibm_db2-1.1.2 running: /tmp/tmps5JBCD/ibm_db2-1.1.2/configure --with-IBM-DB2=/opt/IBM/db2/V8.1checking build system type... i686-redhat-linux-gnu checking host system type... i686-redhat-linux-gnu checking for gcc... gcc checking for C compiler default output file name... a.out checking whether the C compiler works... yes checking whether we are cross compiling... no checking for suffix of executables... checking for suffix of object files... o checking whether we are using the GNU C compiler... yes checking whether gcc accepts -g... yes checking for gcc option to accept ANSI C... none needed checking whether gcc and cc understand -c and -o together... yes checking if compiler supports -R... no checking if compiler supports -Wl,-rpath,... yes checking for PHP prefix... /usr checking for PHP includes... -I/usr/include/php -I/usr/include/php/main -I/usr/include/php/TSRM -I/usr/include/php/Zend checking for PHP extension directory... /usr/lib/php/modules checking for re2c... exit 0; checking for gawk... gawk checking for IBM_DB2 support... yes, shared checking for DB2 CLI files in /opt/IBM/db2/V8.1... yes checking for a sed that does not truncate output... /bin/sed checking for egrep... grep -E checking for ld used by gcc... /usr/bin/ld checking if the linker (/usr/bin/ld) is GNU ld... yes checking for /usr/bin/ld option to reload object files... -r checking for BSD-compatible nm... /usr/bin/nm -B checking whether ln -s works... yes checking how to recognise dependent libraries... pass_all checking how to run the C preprocessor... gcc -E checking for ANSI C header files... yes checking for sys/types.h... yes checking for sys/stat.h... yes checking for stdlib.h... yes checking for string.h... yes checking for memory.h... yes checking for strings.h... yes checking for inttypes.h... yes checking for stdint.h... yes checking for unistd.h... yes checking dlfcn.h usability... yes checking dlfcn.h presence... yes checking for dlfcn.h... yes checking for g++... g++ checking whether we are using the GNU C++ compiler... yes checking whether g++ accepts -g... yes checking how to run the C++ preprocessor... g++ -E checking for g77... g77 checking whether we are using the GNU Fortran 77 compiler... yes checking whether g77 accepts -g... yes checking the maximum length of command line arguments... 32768 checking command to parse /usr/bin/nm -B output from gcc object... ok checking for objdir... .libs checking for ar... ar checking for ranlib... ranlib checking for strip... strip checking if gcc static flag works... yes checking if gcc supports -fno-rtti -fno-exceptions... no checking for gcc option to produce PIC... -fPIC checking if gcc PIC flag -fPIC works... yes checking if gcc supports -c -o file.o... yes checking whether the gcc linker (/usr/bin/ld) supports shared libraries... yes checking whether -lc should be explicitly linked in... no checking dynamic linker characteristics... GNU/Linux ld.so checking how to hardcode library paths into programs... immediate checking whether stripping libraries is possible... yes checking if libtool supports shared libraries... yes checking whether to build shared libraries... yes checking whether to build static libraries... no configure: creating libtool appending configuration tag "CXX" to libtool checking for ld used by g++... /usr/bin/ld checking if the linker (/usr/bin/ld) is GNU ld... yes checking whether the g++ linker (/usr/bin/ld) supports shared libraries... yes checking for g++ option to produce PIC... -fPIC checking if g++ PIC flag -fPIC works... yes checking if g++ supports -c -o file.o... yes checking whether the g++ linker (/usr/bin/ld) supports shared libraries... yes checking dynamic linker characteristics... GNU/Linux ld.so checking how to hardcode library paths into programs... immediate checking whether stripping libraries is possible... yes appending configuration tag "F77" to libtool checking if libtool supports shared libraries... yes checking whether to build shared libraries... yes checking whether to build static libraries... no checking for g77 option to produce PIC... -fPIC checking if g77 PIC flag -fPIC works... yes checking if g77 supports -c -o file.o... yes checking whether the g77 linker (/usr/bin/ld) supports shared libraries... yes checking dynamic linker characteristics... GNU/Linux ld.so checking how to hardcode library paths into programs... immediate checking whether stripping libraries is possible... yes configure: creating ./config.status config.status: creating config.h running: make /bin/sh /var/tmp/pear-build-root/ibm_db2-1.1.2/libtool --mode=compile gcc -I. -I/tmp/tmps5JBCD/ibm_db2-1.1.2 -DPHP_ATOM_INC -I/var/tmp/pear-build-root/ibm_db2-1.1.2/include -I/var/tmp/pear-build-root/ibm_db2-1.1.2/main -I/tmp/tmps5JBCD/ibm_db2-1.1.2 -I/usr/include/php -I/usr/include/php/main -I/usr/include/php/TSRM -I/usr/include/php/Zend -I/opt/IBM/db2/V8.1/include -DHAVE_CONFIG_H -g -O2 -c /tmp/tmps5JBCD/ibm_db2-1.1.2/ibm_db2.c -o ibm_db2.lo mkdir .libs gcc -I. -I/tmp/tmps5JBCD/ibm_db2-1.1.2 -DPHP_ATOM_INC -I/var/tmp/pear-build-root/ibm_db2-1.1.2/include -I/var/tmp/pear-build-root/ibm_db2-1.1.2/main -I/tmp/tmps5JBCD/ibm_db2-1.1.2 -I/usr/include/php -I/usr/include/php/main -I/usr/include/php/TSRM -I/usr/include/php/Zend -I/opt/IBM/db2/V8.1/include -DHAVE_CONFIG_H -g -O2 -c /tmp/tmps5JBCD/ibm_db2-1.1.2/ibm_db2.c -fPIC -DPIC -o .libs/ibm_db2.o /tmp/tmps5JBCD/ibm_db2-1.1.2/ibm_db2.c: In function '_php_db2_check_sql_errors':/tmp/tmps5JBCD/ibm_db2-1.1.2/ibm_db2.c:504: warning: pointer targets in passing argument 1 of '__builtin_strchr' differ in signedness /tmp/tmps5JBCD/ibm_db2-1.1.2/ibm_db2.c:507: warning: pointer targets in passing argument 1 of 'php_sprintf' differ in signedness /tmp/tmps5JBCD/ibm_db2-1.1.2/ibm_db2.c:516: warning: pointer targets in passing argument 2 of '__builtin_strncpy' differ in signedness /tmp/tmps5JBCD/ibm_db2-1.1.2/ibm_db2.c:517: warning: pointer targets in passing argument 2 of '__builtin_strncpy' differ in signedness /tmp/tmps5JBCD/ibm_db2-1.1.2/ibm_db2.c:521: warning: pointer targets in passing argument 2 of '__builtin_strncpy' differ in signedness /tmp/tmps5JBCD/ibm_db2-1.1.2/ibm_db2.c:522: warning: pointer targets in passing argument 2 of '__builtin_strncpy' differ in signedness /tmp/tmps5JBCD/ibm_db2-1.1.2/ibm_db2.c:532: warning: pointer targets in passing argument 2 of '__builtin_strncpy' differ in signedness /tmp/tmps5JBCD/ibm_db2-1.1.2/ibm_db2.c:537: warning: pointer targets in passing argument 2 of '__builtin_strncpy' differ in signedness /tmp/tmps5JBCD/ibm_db2-1.1.2/ibm_db2.c: In function '_php_db2_get_result_set_info': /tmp/tmps5JBCD/ibm_db2-1.1.2/ibm_db2.c:723: warning: pointer targets in passing argument 3 of 'SQLDescribeCol' differ in signedness /tmp/tmps5JBCD/ibm_db2-1.1.2/ibm_db2.c:728: warning: pointer targets in assignment differ in signedness /tmp/tmps5JBCD/ibm_db2-1.1.2/ibm_db2.c:740: warning: pointer targets in assignment differ in signedness /tmp/tmps5JBCD/ibm_db2-1.1.2/ibm_db2.c: In function '_php_db2_connect_helper': /tmp/tmps5JBCD/ibm_db2-1.1.2/ibm_db2.c:908: error: 'SQL_ATTR_PING_DB' undeclared (first use in this function) /tmp/tmps5JBCD/ibm_db2-1.1.2/ibm_db2.c:908: error: (Each undeclared identifier is reported only once /tmp/tmps5JBCD/ibm_db2-1.1.2/ibm_db2.c:908: error: for each function it appears in.) /tmp/tmps5JBCD/ibm_db2-1.1.2/ibm_db2.c: In function 'zif_db2_column_privileges':/tmp/tmps5JBCD/ibm_db2-1.1.2/ibm_db2.c:1353: warning: pointer targets in passing argument 2 of 'SQLColumnPrivileges' differ in signedness /tmp/tmps5JBCD/ibm_db2-1.1.2/ibm_db2.c:1353: warning: pointer targets in passing argument 4 of 'SQLColumnPrivileges' differ in signedness /tmp/tmps5JBCD/ibm_db2-1.1.2/ibm_db2.c:1353: warning: pointer targets in passing argument 6 of 'SQLColumnPrivileges' differ in signedness /tmp/tmps5JBCD/ibm_db2-1.1.2/ibm_db2.c:1353: warning: pointer targets in passing argument 8 of 'SQLColumnPrivileges' differ in signedness /tmp/tmps5JBCD/ibm_db2-1.1.2/ibm_db2.c: In function 'zif_db2_columns': /tmp/tmps5JBCD/ibm_db2-1.1.2/ibm_db2.c:1400: warning: pointer targets in passing argument 2 of 'SQLColumns' differ in signedness /tmp/tmps5JBCD/ibm_db2-1.1.2/ibm_db2.c:1400: warning: pointer targets in passing argument 4 of 'SQLColumns' differ in signedness /tmp/tmps5JBCD/ibm_db2-1.1.2/ibm_db2.c:1400: warning: pointer targets in passing argument 6 of 'SQLColumns' differ in signedness /tmp/tmps5JBCD/ibm_db2-1.1.2/ibm_db2.c:1400: warning: pointer targets in passing argument 8 of 'SQLColumns' differ in signedness /tmp/tmps5JBCD/ibm_db2-1.1.2/ibm_db2.c: In function 'zif_db2_foreign_keys': /tmp/tmps5JBCD/ibm_db2-1.1.2/ibm_db2.c:1447: warning: pointer targets in passing argument 2 of 'SQLForeignKeys' differ in signedness /tmp/tmps5JBCD/ibm_db2-1.1.2/ibm_db2.c:1447: warning: pointer targets in passing argument 4 of 'SQLForeignKeys' differ in signedness /tmp/tmps5JBCD/ibm_db2-1.1.2/ibm_db2.c:1447: warning: pointer targets in passing argument 6 of 'SQLForeignKeys' differ in signedness /tmp/tmps5JBCD/ibm_db2-1.1.2/ibm_db2.c:1447: warning: pointer targets in passing argument 8 of 'SQLForeignKeys' differ in signedness /tmp/tmps5JBCD/ibm_db2-1.1.2/ibm_db2.c:1447: warning: pointer targets in passing argument 10 of 'SQLForeignKeys' differ in signedness /tmp/tmps5JBCD/ibm_db2-1.1.2/ibm_db2.c:1447: warning: pointer targets in passing argument 12 of 'SQLForeignKeys' differ in signedness /tmp/tmps5JBCD/ibm_db2-1.1.2/ibm_db2.c: In function 'zif_db2_primary_keys': /tmp/tmps5JBCD/ibm_db2-1.1.2/ibm_db2.c:1493: warning: pointer targets in passing argument 2 of 'SQLPrimaryKeys' differ in signedness /tmp/tmps5JBCD/ibm_db2-1.1.2/ibm_db2.c:1493: warning: pointer targets in passing argument 4 of 'SQLPrimaryKeys' differ in signedness /tmp/tmps5JBCD/ibm_db2-1.1.2/ibm_db2.c:1493: warning: pointer targets in passing argument 6 of 'SQLPrimaryKeys' differ in signedness /tmp/tmps5JBCD/ibm_db2-1.1.2/ibm_db2.c: In function 'zif_db2_procedure_columns':/tmp/tmps5JBCD/ibm_db2-1.1.2/ibm_db2.c:1540: warning: pointer targets in passing argument 2 of 'SQLProcedureColumns' differ in signedness /tmp/tmps5JBCD/ibm_db2-1.1.2/ibm_db2.c:1540: warning: pointer targets in passing argument 4 of 'SQLProcedureColumns' differ in signedness /tmp/tmps5JBCD/ibm_db2-1.1.2/ibm_db2.c:1540: warning: pointer targets in passing argument 6 of 'SQLProcedureColumns' differ in signedness /tmp/tmps5JBCD/ibm_db2-1.1.2/ibm_db2.c:1540: warning: pointer targets in passing argument 8 of 'SQLProcedureColumns' differ in signedness /tmp/tmps5JBCD/ibm_db2-1.1.2/ibm_db2.c: In function 'zif_db2_procedures': /tmp/tmps5JBCD/ibm_db2-1.1.2/ibm_db2.c:1583: warning: pointer targets in passing argument 2 of 'SQLProcedures' differ in signedness /tmp/tmps5JBCD/ibm_db2-1.1.2/ibm_db2.c:1583: warning: pointer targets in passing argument 4 of 'SQLProcedures' differ in signedness /tmp/tmps5JBCD/ibm_db2-1.1.2/ibm_db2.c:1583: warning: pointer targets in passing argument 6 of 'SQLProcedures' differ in signedness /tmp/tmps5JBCD/ibm_db2-1.1.2/ibm_db2.c: In function 'zif_db2_special_columns': /tmp/tmps5JBCD/ibm_db2-1.1.2/ibm_db2.c:1628: warning: pointer targets in passing argument 3 of 'SQLSpecialColumns' differ in signedness /tmp/tmps5JBCD/ibm_db2-1.1.2/ibm_db2.c:1628: warning: pointer targets in passing argument 5 of 'SQLSpecialColumns' differ in signedness /tmp/tmps5JBCD/ibm_db2-1.1.2/ibm_db2.c:1628: warning: pointer targets in passing argument 7 of 'SQLSpecialColumns' differ in signedness /tmp/tmps5JBCD/ibm_db2-1.1.2/ibm_db2.c: In function 'zif_db2_statistics': /tmp/tmps5JBCD/ibm_db2-1.1.2/ibm_db2.c:1676: warning: pointer targets in passing argument 2 of 'SQLStatistics' differ in signedness /tmp/tmps5JBCD/ibm_db2-1.1.2/ibm_db2.c:1676: warning: pointer targets in passing argument 4 of 'SQLStatistics' differ in signedness /tmp/tmps5JBCD/ibm_db2-1.1.2/ibm_db2.c:1676: warning: pointer targets in passing argument 6 of 'SQLStatistics' differ in signedness /tmp/tmps5JBCD/ibm_db2-1.1.2/ibm_db2.c: In function 'zif_db2_table_privileges': /tmp/tmps5JBCD/ibm_db2-1.1.2/ibm_db2.c:1725: warning: pointer targets in passing argument 2 of 'SQLTablePrivileges' differ in signedness /tmp/tmps5JBCD/ibm_db2-1.1.2/ibm_db2.c:1725: warning: pointer targets in passing argument 4 of 'SQLTablePrivileges' differ in signedness /tmp/tmps5JBCD/ibm_db2-1.1.2/ibm_db2.c:1725: warning: pointer targets in passing argument 6 of 'SQLTablePrivileges' differ in signedness /tmp/tmps5JBCD/ibm_db2-1.1.2/ibm_db2.c: In function 'zif_db2_tables': /tmp/tmps5JBCD/ibm_db2-1.1.2/ibm_db2.c:1772: warning: pointer targets in passing argument 2 of 'SQLTables' differ in signedness /tmp/tmps5JBCD/ibm_db2-1.1.2/ibm_db2.c:1772: warning: pointer targets in passing argument 4 of 'SQLTables' differ in signedness /tmp/tmps5JBCD/ibm_db2-1.1.2/ibm_db2.c:1772: warning: pointer targets in passing argument 6 of 'SQLTables' differ in signedness /tmp/tmps5JBCD/ibm_db2-1.1.2/ibm_db2.c:1772: warning: pointer targets in passing argument 8 of 'SQLTables' differ in signedness /tmp/tmps5JBCD/ibm_db2-1.1.2/ibm_db2.c: In function '_php_db2_bind_data': /tmp/tmps5JBCD/ibm_db2-1.1.2/ibm_db2.c:2046: warning: pointer targets in passing argument 4 of 'SQLBindFileToParam' differ in signedness /tmp/tmps5JBCD/ibm_db2-1.1.2/ibm_db2.c: In function '_php_db2_get_column_by_name': /tmp/tmps5JBCD/ibm_db2-1.1.2/ibm_db2.c:2664: warning: pointer targets in passing argument 1 of 'strlen' differ in signedness /tmp/tmps5JBCD/ibm_db2-1.1.2/ibm_db2.c:2664: warning: pointer targets in passing argument 1 of '__builtin_strcmp' differ in signedness /tmp/tmps5JBCD/ibm_db2-1.1.2/ibm_db2.c:2664: warning: pointer targets in passing argument 1 of 'strlen' differ in signedness /tmp/tmps5JBCD/ibm_db2-1.1.2/ibm_db2.c:2664: warning: pointer targets in passing argument 1 of '__builtin_strcmp' differ in signedness /tmp/tmps5JBCD/ibm_db2-1.1.2/ibm_db2.c:2664: warning: pointer targets in passing argument 1 of '__builtin_strcmp' differ in signedness /tmp/tmps5JBCD/ibm_db2-1.1.2/ibm_db2.c:2664: warning: pointer targets in passing argument 1 of '__builtin_strcmp' differ in signedness /tmp/tmps5JBCD/ibm_db2-1.1.2/ibm_db2.c: In function 'zif_db2_field_name': /tmp/tmps5JBCD/ibm_db2-1.1.2/ibm_db2.c:2701: warning: pointer targets in initialization differ in signedness /tmp/tmps5JBCD/ibm_db2-1.1.2/ibm_db2.c: In function '_php_db2_bind_fetch_helper': /tmp/tmps5JBCD/ibm_db2-1.1.2/ibm_db2.c:3256: warning: pointer targets in passing argument 1 of 'strlen' differ in signedness /tmp/tmps5JBCD/ibm_db2-1.1.2/ibm_db2.c:3256: warning: pointer targets in passing argument 2 of 'add_assoc_null_ex' differ in signedness /tmp/tmps5JBCD/ibm_db2-1.1.2/ibm_db2.c:3274: warning: pointer targets in passing argument 1 of 'strlen' differ in signedness /tmp/tmps5JBCD/ibm_db2-1.1.2/ibm_db2.c:3274: warning: pointer targets in passing argument 2 of 'add_assoc_stringl_ex' differ in signedness /tmp/tmps5JBCD/ibm_db2-1.1.2/ibm_db2.c:3284: warning: pointer targets in passing argument 1 of 'strlen' differ in signedness /tmp/tmps5JBCD/ibm_db2-1.1.2/ibm_db2.c:3284: warning: pointer targets in passing argument 2 of 'add_assoc_long_ex' differ in signedness /tmp/tmps5JBCD/ibm_db2-1.1.2/ibm_db2.c:3292: warning: pointer targets in passing argument 1 of 'strlen' differ in signedness /tmp/tmps5JBCD/ibm_db2-1.1.2/ibm_db2.c:3292: warning: pointer targets in passing argument 2 of 'add_assoc_long_ex' differ in signedness /tmp/tmps5JBCD/ibm_db2-1.1.2/ibm_db2.c:3303: warning: pointer targets in passing argument 1 of 'strlen' differ in signedness /tmp/tmps5JBCD/ibm_db2-1.1.2/ibm_db2.c:3303: warning: pointer targets in passing argument 2 of 'add_assoc_double_ex' differ in signedness /tmp/tmps5JBCD/ibm_db2-1.1.2/ibm_db2.c:3312: warning: pointer targets in passing argument 1 of 'strlen' differ in signedness /tmp/tmps5JBCD/ibm_db2-1.1.2/ibm_db2.c:3312: warning: pointer targets in passing argument 2 of 'add_assoc_double_ex' differ in signedness /tmp/tmps5JBCD/ibm_db2-1.1.2/ibm_db2.c:3324: warning: pointer targets in passing argument 1 of 'strlen' differ in signedness /tmp/tmps5JBCD/ibm_db2-1.1.2/ibm_db2.c:3324: warning: pointer targets in passing argument 2 of 'add_assoc_stringl_ex' differ in signedness /tmp/tmps5JBCD/ibm_db2-1.1.2/ibm_db2.c:3331: warning: pointer targets in passing argument 1 of 'strlen' differ in signedness /tmp/tmps5JBCD/ibm_db2-1.1.2/ibm_db2.c:3331: warning: pointer targets in passing argument 2 of 'add_assoc_stringl_ex' differ in signedness /tmp/tmps5JBCD/ibm_db2-1.1.2/ibm_db2.c:3351: warning: pointer targets in passing argument 1 of 'strlen' differ in signedness /tmp/tmps5JBCD/ibm_db2-1.1.2/ibm_db2.c:3351: warning: pointer targets in passing argument 2 of 'add_assoc_null_ex' differ in signedness /tmp/tmps5JBCD/ibm_db2-1.1.2/ibm_db2.c:3360: warning: pointer targets in passing argument 1 of 'strlen' differ in signedness /tmp/tmps5JBCD/ibm_db2-1.1.2/ibm_db2.c:3360: warning: pointer targets in passing argument 2 of 'add_assoc_null_ex' differ in signedness /tmp/tmps5JBCD/ibm_db2-1.1.2/ibm_db2.c:3386: warning: pointer targets in passing argument 1 of 'strlen' differ in signedness /tmp/tmps5JBCD/ibm_db2-1.1.2/ibm_db2.c:3386: warning: pointer targets in passing argument 2 of 'add_assoc_stringl_ex' differ in signedness /tmp/tmps5JBCD/ibm_db2-1.1.2/ibm_db2.c:3386: warning: pointer targets in passing argument 4 of 'add_assoc_stringl_ex' differ in signedness /tmp/tmps5JBCD/ibm_db2-1.1.2/ibm_db2.c:3389: warning: pointer targets in passing argument 3 of 'add_index_stringl' differ in signedness /tmp/tmps5JBCD/ibm_db2-1.1.2/ibm_db2.c:3408: warning: pointer targets in passing argument 1 of 'strlen' differ in signedness /tmp/tmps5JBCD/ibm_db2-1.1.2/ibm_db2.c:3408: warning: pointer targets in passing argument 2 of 'add_assoc_null_ex' differ in signedness /tmp/tmps5JBCD/ibm_db2-1.1.2/ibm_db2.c:3429: warning: pointer targets in passing argument 1 of 'strlen' differ in signedness /tmp/tmps5JBCD/ibm_db2-1.1.2/ibm_db2.c:3429: warning: pointer targets in passing argument 2 of 'add_assoc_stringl_ex' differ in signedness /tmp/tmps5JBCD/ibm_db2-1.1.2/ibm_db2.c:3429: warning: pointer targets in passing argument 4 of 'add_assoc_stringl_ex' differ in signedness /tmp/tmps5JBCD/ibm_db2-1.1.2/ibm_db2.c:3432: warning: pointer targets in passing argument 3 of 'add_index_stringl' differ in signedness /tmp/tmps5JBCD/ibm_db2-1.1.2/ibm_db2.c: In function 'zif_db2_server_info': /tmp/tmps5JBCD/ibm_db2-1.1.2/ibm_db2.c:3595: warning: pointer targets in passing argument 1 of 'strlen' differ in signedness /tmp/tmps5JBCD/ibm_db2-1.1.2/ibm_db2.c:3595: warning: pointer targets in passing argument 4 of 'add_property_stringl_ex' differ in signedness /tmp/tmps5JBCD/ibm_db2-1.1.2/ibm_db2.c:3606: warning: pointer targets in passing argument 1 of 'strlen' differ in signedness /tmp/tmps5JBCD/ibm_db2-1.1.2/ibm_db2.c:3606: warning: pointer targets in passing argument 4 of 'add_property_stringl_ex' differ in signedness /tmp/tmps5JBCD/ibm_db2-1.1.2/ibm_db2.c:3611: error: 'SQL_DATABASE_CODEPAGE' undeclared (first use in this function) /tmp/tmps5JBCD/ibm_db2-1.1.2/ibm_db2.c:3628: warning: pointer targets in passing argument 1 of 'strlen' differ in signedness /tmp/tmps5JBCD/ibm_db2-1.1.2/ibm_db2.c:3628: warning: pointer targets in passing argument 4 of 'add_property_stringl_ex' differ in signedness /tmp/tmps5JBCD/ibm_db2-1.1.2/ibm_db2.c:3639: warning: pointer targets in passing argument 1 of 'strlen' differ in signedness /tmp/tmps5JBCD/ibm_db2-1.1.2/ibm_db2.c:3639: warning: pointer targets in passing argument 4 of 'add_property_stringl_ex' differ in signedness /tmp/tmps5JBCD/ibm_db2-1.1.2/ibm_db2.c:3650: warning: pointer targets in passing argument 1 of 'strlen' differ in signedness /tmp/tmps5JBCD/ibm_db2-1.1.2/ibm_db2.c:3650: warning: pointer targets in passing argument 4 of 'add_property_stringl_ex' differ in signedness /tmp/tmps5JBCD/ibm_db2-1.1.2/ibm_db2.c:3669: warning: pointer targets in passing argument 1 of '__strtok_r_1c' differ in signedness /tmp/tmps5JBCD/ibm_db2-1.1.2/ibm_db2.c:3669: warning: pointer targets in passing argument 1 of '__strtok_r' differ in signedness /tmp/tmps5JBCD/ibm_db2-1.1.2/ibm_db2.c:3669: warning: pointer targets in passing argument 1 of '__strtok_r' differ in signedness /tmp/tmps5JBCD/ibm_db2-1.1.2/ibm_db2.c:3687: warning: pointer targets in passing argument 1 of 'strcpy' differ in signedness /tmp/tmps5JBCD/ibm_db2-1.1.2/ibm_db2.c:3690: warning: pointer targets in passing argument 1 of 'strcpy' differ in signedness /tmp/tmps5JBCD/ibm_db2-1.1.2/ibm_db2.c:3693: warning: pointer targets in passing argument 1 of 'strcpy' differ in signedness /tmp/tmps5JBCD/ibm_db2-1.1.2/ibm_db2.c:3696: warning: pointer targets in passing argument 1 of 'strcpy' differ in signedness /tmp/tmps5JBCD/ibm_db2-1.1.2/ibm_db2.c:3699: warning: pointer targets in passing argument 1 of 'strcpy' differ in signedness /tmp/tmps5JBCD/ibm_db2-1.1.2/ibm_db2.c:3702: warning: pointer targets in passing argument 1 of 'strlen' differ in signedness /tmp/tmps5JBCD/ibm_db2-1.1.2/ibm_db2.c:3702: warning: pointer targets in passing argument 4 of 'add_property_stringl_ex' differ in signedness /tmp/tmps5JBCD/ibm_db2-1.1.2/ibm_db2.c:3749: warning: pointer targets in passing argument 1 of 'strcpy' differ in signedness /tmp/tmps5JBCD/ibm_db2-1.1.2/ibm_db2.c:3752: warning: pointer targets in passing argument 1 of 'strcpy' differ in signedness /tmp/tmps5JBCD/ibm_db2-1.1.2/ibm_db2.c:3755: warning: pointer targets in passing argument 1 of 'strcpy' differ in signedness /tmp/tmps5JBCD/ibm_db2-1.1.2/ibm_db2.c:3758: warning: pointer targets in passing argument 1 of 'strcpy' differ in signedness /tmp/tmps5JBCD/ibm_db2-1.1.2/ibm_db2.c:3763: warning: pointer targets in passing argument 1 of 'strlen' differ in signedness /tmp/tmps5JBCD/ibm_db2-1.1.2/ibm_db2.c:3763: warning: pointer targets in passing argument 4 of 'add_property_stringl_ex' differ in signedness /tmp/tmps5JBCD/ibm_db2-1.1.2/ibm_db2.c:3774: warning: pointer targets in passing argument 1 of 'strlen' differ in signedness /tmp/tmps5JBCD/ibm_db2-1.1.2/ibm_db2.c:3774: warning: pointer targets in passing argument 1 of '__builtin_strcmp' differ in signedness /tmp/tmps5JBCD/ibm_db2-1.1.2/ibm_db2.c:3774: warning: pointer targets in passing argument 1 of 'strlen' differ in signedness /tmp/tmps5JBCD/ibm_db2-1.1.2/ibm_db2.c:3774: warning: pointer targets in passing argument 1 of '__builtin_strcmp' differ in signedness /tmp/tmps5JBCD/ibm_db2-1.1.2/ibm_db2.c:3774: warning: pointer targets in passing argument 1 of '__builtin_strcmp' differ in signedness /tmp/tmps5JBCD/ibm_db2-1.1.2/ibm_db2.c:3774: warning: pointer targets in passing argument 1 of '__builtin_strcmp' differ in signedness /tmp/tmps5JBCD/ibm_db2-1.1.2/ibm_db2.c:3789: warning: pointer targets in passing argument 1 of 'strlen' differ in signedness /tmp/tmps5JBCD/ibm_db2-1.1.2/ibm_db2.c:3789: warning: pointer targets in passing argument 4 of 'add_property_stringl_ex' differ in signedness /tmp/tmps5JBCD/ibm_db2-1.1.2/ibm_db2.c:3800: warning: pointer targets in passing argument 1 of 'strlen' differ in signedness /tmp/tmps5JBCD/ibm_db2-1.1.2/ibm_db2.c:3800: warning: pointer targets in passing argument 1 of '__builtin_strcmp' differ in signedness /tmp/tmps5JBCD/ibm_db2-1.1.2/ibm_db2.c:3800: warning: pointer targets in passing argument 1 of 'strlen' differ in signedness /tmp/tmps5JBCD/ibm_db2-1.1.2/ibm_db2.c:3800: warning: pointer targets in passing argument 1 of '__builtin_strcmp' differ in signedness /tmp/tmps5JBCD/ibm_db2-1.1.2/ibm_db2.c:3800: warning: pointer targets in passing argument 1 of '__builtin_strcmp' differ in signedness /tmp/tmps5JBCD/ibm_db2-1.1.2/ibm_db2.c:3800: warning: pointer targets in passing argument 1 of '__builtin_strcmp' differ in signedness /tmp/tmps5JBCD/ibm_db2-1.1.2/ibm_db2.c: In function 'zif_db2_client_info': /tmp/tmps5JBCD/ibm_db2-1.1.2/ibm_db2.c:3953: warning: pointer targets in passing argument 1 of 'strlen' differ in signedness /tmp/tmps5JBCD/ibm_db2-1.1.2/ibm_db2.c:3953: warning: pointer targets in passing argument 4 of 'add_property_stringl_ex' differ in signedness /tmp/tmps5JBCD/ibm_db2-1.1.2/ibm_db2.c:3964: warning: pointer targets in passing argument 1 of 'strlen' differ in signedness /tmp/tmps5JBCD/ibm_db2-1.1.2/ibm_db2.c:3964: warning: pointer targets in passing argument 4 of 'add_property_stringl_ex' differ in signedness /tmp/tmps5JBCD/ibm_db2-1.1.2/ibm_db2.c:3975: warning: pointer targets in passing argument 1 of 'strlen' differ in signedness /tmp/tmps5JBCD/ibm_db2-1.1.2/ibm_db2.c:3975: warning: pointer targets in passing argument 4 of 'add_property_stringl_ex' differ in signedness /tmp/tmps5JBCD/ibm_db2-1.1.2/ibm_db2.c:3986: warning: pointer targets in passing argument 1 of 'strlen' differ in signedness /tmp/tmps5JBCD/ibm_db2-1.1.2/ibm_db2.c:3986: warning: pointer targets in passing argument 4 of 'add_property_stringl_ex' differ in signedness /tmp/tmps5JBCD/ibm_db2-1.1.2/ibm_db2.c:3997: warning: pointer targets in passing argument 1 of 'strlen' differ in signedness /tmp/tmps5JBCD/ibm_db2-1.1.2/ibm_db2.c:3997: warning: pointer targets in passing argument 4 of 'add_property_stringl_ex' differ in signedness /tmp/tmps5JBCD/ibm_db2-1.1.2/ibm_db2.c:4010: warning: pointer targets in passing argument 1 of 'strcpy' differ in signedness /tmp/tmps5JBCD/ibm_db2-1.1.2/ibm_db2.c:4013: warning: pointer targets in passing argument 1 of 'strcpy' differ in signedness /tmp/tmps5JBCD/ibm_db2-1.1.2/ibm_db2.c:4016: warning: pointer targets in passing argument 1 of 'strcpy' differ in signedness /tmp/tmps5JBCD/ibm_db2-1.1.2/ibm_db2.c:4021: warning: pointer targets in passing argument 1 of 'strlen' differ in signedness /tmp/tmps5JBCD/ibm_db2-1.1.2/ibm_db2.c:4021: warning: pointer targets in passing argument 4 of 'add_property_stringl_ex' differ in signedness /tmp/tmps5JBCD/ibm_db2-1.1.2/ibm_db2.c:4026: error: 'SQL_APPLICATION_CODEPAGE' undeclared (first use in this function) /tmp/tmps5JBCD/ibm_db2-1.1.2/ibm_db2.c:4037: error: 'SQL_CONNECT_CODEPAGE' undeclared (first use in this function) make: *** [ibm_db2.lo] Error 1 `make' failed [root@twink ~]# Any help is greatly appreciated :) -Chris

« previous php.pecl.dev (#3034) next »