PHP make-test Results Report
| From: | Hanh Nguyen | Date: | Mon, 31 Oct 2016 05:11:32 +0000 |
| Subject: | PHP make-test Results Report | ||
| Groups: | php.qa.reports | ||
| Request: | Send a blank email to php-qa-reports+get-33755@lists.php.net to get a copy of this message | ||
Dear Support Team,
This is my PHP make-test result.
Yours sincerely
--
株式会社 メディアウォーズ
技術部 グェン テー ハイン
Email: hanh@mediawars.ne.jp
TEL:075-323-1515 FAX:075-323-1501
===================================================================== EXPECTED FAILED TEST SUMMARY --------------------------------------------------------------------- Test open_basedir configuration [tests/security/open_basedir_linkinfo.phpt] XFAIL REASON: BUG: open_basedir cannot delete symlink to prohibited file. See also bugs 48111 and 52176. Inconsistencies when accessing protected members [Zend/tests/access_modifiers_008.phpt] XFAIL REASON: Discussion: http://marc.info/?l=php-internals&m=120221184420957&w=2 Inconsistencies when accessing protected members - 2 [Zend/tests/access_modifiers_009.phpt] XFAIL REASON: Discussion: http://marc.info/?l=php-internals&m=120221184420957&w=2 Bug #48770 (call_user_func_array() fails to call parent from inheriting class) [Zend/tests/bug48770.phpt] XFAIL REASON: See Bug #48770 Bug #48770 (call_user_func_array() fails to call parent from inheriting class) [Zend/tests/bug48770_2.phpt] XFAIL REASON: See Bug #48770 Bug #48770 (call_user_func_array() fails to call parent from inheriting class) [Zend/tests/bug48770_3.phpt] XFAIL REASON: See Bug #48770 Bug #64896 (Segfault with gc_collect_cycles using unserialize on certain objects) [Zend/tests/bug64896.phpt] XFAIL REASON: We can not fix this bug without a significant (performace slow down) change to gc Initial value of static var in method depends on the include time of the class definition [Zend/tests/method_static_var.phpt] XFAIL REASON: Maybe not a bug DateTime::add() -- fall type2 type3 [ext/date/tests/DateTime_add-fall-type2-type3.phpt] XFAIL REASON: Various bugs exist DateTime::add() -- fall type3 type2 [ext/date/tests/DateTime_add-fall-type3-type2.phpt] XFAIL REASON: Various bugs exist DateTime::add() -- fall type3 type3 [ext/date/tests/DateTime_add-fall-type3-type3.phpt] XFAIL REASON: Various bugs exist DateTime::add() -- spring type2 type3 [ext/date/tests/DateTime_add-spring-type2-type3.phpt] XFAIL REASON: Various bugs exist DateTime::add() -- spring type3 type2 [ext/date/tests/DateTime_add-spring-type3-type2.phpt] XFAIL REASON: Various bugs exist DateTime::add() -- spring type3 type3 [ext/date/tests/DateTime_add-spring-type3-type3.phpt] XFAIL REASON: Various bugs exist DateTime::diff() -- fall type2 type3 [ext/date/tests/DateTime_diff-fall-type2-type3.phpt] XFAIL REASON: Various bugs exist DateTime::diff() -- fall type3 type2 [ext/date/tests/DateTime_diff-fall-type3-type2.phpt] XFAIL REASON: Various bugs exist DateTime::diff() -- fall type3 type3 [ext/date/tests/DateTime_diff-fall-type3-type3.phpt] XFAIL REASON: Various bugs exist DateTime::diff() -- spring type2 type3 [ext/date/tests/DateTime_diff-spring-type2-type3.phpt] XFAIL REASON: Various bugs exist DateTime::diff() -- spring type3 type2 [ext/date/tests/DateTime_diff-spring-type3-type2.phpt] XFAIL REASON: Various bugs exist DateTime::diff() -- spring type3 type3 [ext/date/tests/DateTime_diff-spring-type3-type3.phpt] XFAIL REASON: Various bugs exist DateTime::sub() -- fall type2 type3 [ext/date/tests/DateTime_sub-fall-type2-type3.phpt] XFAIL REASON: Various bugs exist DateTime::sub() -- fall type3 type2 [ext/date/tests/DateTime_sub-fall-type3-type2.phpt] XFAIL REASON: Various bugs exist DateTime::sub() -- fall type3 type3 [ext/date/tests/DateTime_sub-fall-type3-type3.phpt] XFAIL REASON: Various bugs exist DateTime::sub() -- spring type2 type3 [ext/date/tests/DateTime_sub-spring-type2-type3.phpt] XFAIL REASON: Various bugs exist DateTime::sub() -- spring type3 type2 [ext/date/tests/DateTime_sub-spring-type3-type2.phpt] XFAIL REASON: Various bugs exist DateTime::sub() -- spring type3 type3 [ext/date/tests/DateTime_sub-spring-type3-type3.phpt] XFAIL REASON: Various bugs exist RFC: DateTime and Daylight Saving Time Transitions (zone type 3, bd2) [ext/date/tests/rfc-datetime_and_daylight_saving_time-type3-bd2.phpt] XFAIL REASON: Still not quite right RFC: DateTime and Daylight Saving Time Transitions (zone type 3, fs) [ext/date/tests/rfc-datetime_and_daylight_saving_time-type3-fs.phpt] XFAIL REASON: Still not quite right Bug #42718 (unsafe_raw filter not applied when configured as default filter) [ext/filter/tests/bug42718.phpt] XFAIL REASON: FILTER_UNSAFE_RAW not applied when configured as default filter, even with flags Bug #67296 (filter_input doesn't validate variables) [ext/filter/tests/bug49184.phpt] XFAIL REASON: See Bug #49184 Bug #39858 (Lost connection to MySQL server during query by a repeated call stored proced) [ext/pdo_mysql/tests/bug_39858.phpt] XFAIL REASON: nextRowset() problem with stored proc & emulation mode & mysqlnd PDO MySQL Bug #41997 (stored procedure call returning single rowset blocks future queries) [ext/pdo_mysql/tests/bug_41997.phpt] XFAIL REASON: nextRowset() problem with stored proc & emulation mode & mysqlnd PECL Bug #7976 (Calling stored procedure several times) [ext/pdo_mysql/tests/bug_pecl_7976.phpt] XFAIL REASON: Works with mysqlnd. It is not supported by libmysql. For libmysql is good enough to see no crash. MySQL Prepared Statements and different column counts [ext/pdo_mysql/tests/pdo_mysql_stmt_variable_columncount.phpt] XFAIL REASON: nextRowset() problem with stored proc & emulation mode & mysqlnd ===================================================================== ===================================================================== FAILED TEST SUMMARY --------------------------------------------------------------------- Bug #30638 (localeconv returns wrong LC_NUMERIC settings) (ok to fail on MacOS X) [tests/lang/bug30638.phpt] Test open_basedir configuration [tests/security/open_basedir_is_executable.phpt] Test getdate() function : usage variation - Passing high positive and negative float values to timestamp. [ext/date/tests/getdate_variation7.phpt] Test localtime() function : usage variation - Passing higher positive and negetive float values to timestamp. [ext/date/tests/localtime_variation3.phpt] Bug #61411 (PDO Segfaults with PERSISTENT == TRUE && EMULATE_PREPARES == FALSE) [ext/pdo_mysql/tests/bug_61411.phpt] PDO::ATTR_ORACLE_NULLS [ext/pdo_mysql/tests/pdo_mysql_attr_oracle_nulls.phpt] MySQL PDO->exec(), affected rows [ext/pdo_mysql/tests/pdo_mysql_exec.phpt] MySQL PDO->exec(), affected rows [ext/pdo_mysql/tests/pdo_mysql_exec_load_data.phpt] Testing xpath() with invalid XML [ext/simplexml/tests/SimpleXMLElement_xpath.phpt] Test is_executable() function: usage variations - diff. path notations [ext/standard/tests/file/is_executable_variation1.phpt] Test mail() function : variation invalid program for sendmail [ext/standard/tests/mail/mail_variation1.phpt] Bug #64146 (serialize incorrectly saving objects when they are cloned) [ext/standard/tests/serialize/bug64146.phpt] Test setlocale() function : usage variations - Setting all available locales in the platform [ext/standard/tests/strings/setlocale_variation2.phpt] Test strptime() function : basic functionality [ext/standard/tests/time/strptime_basic.phpt] ===================================================================== ===================================================================== WARNED TEST SUMMARY --------------------------------------------------------------------- MySQL PDO->prepare(), emulated PS [ext/pdo_mysql/tests/pdo_mysql_prepare_emulated.phpt] (warn: XFAIL section but test passes) ===================================================================== ===================================================================== TEST RESULT SUMMARY --------------------------------------------------------------------- Exts skipped : 51 Exts tested : 28 --------------------------------------------------------------------- Number of tests : 13589 9039 Tests skipped : 4550 ( 33.5%) -------- Tests warned : 1 ( 0.0%) ( 0.0%) Tests failed : 14 ( 0.1%) ( 0.2%) Expected fail : 34 ( 0.3%) ( 0.4%) Tests passed : 8990 ( 66.2%) ( 99.5%) --------------------------------------------------------------------- Time taken : 497 seconds ===================================================================== ===================================================================== EXPECTED FAILED TEST SUMMARY --------------------------------------------------------------------- Test open_basedir configuration [tests/security/open_basedir_linkinfo.phpt] XFAIL REASON: BUG: open_basedir cannot delete symlink to prohibited file. See also bugs 48111 and 52176. Inconsistencies when accessing protected members [Zend/tests/access_modifiers_008.phpt] XFAIL REASON: Discussion: http://marc.info/?l=php-internals&m=120221184420957&w=2 Inconsistencies when accessing protected members - 2 [Zend/tests/access_modifiers_009.phpt] XFAIL REASON: Discussion: http://marc.info/?l=php-internals&m=120221184420957&w=2 Bug #48770 (call_user_func_array() fails to call parent from inheriting class) [Zend/tests/bug48770.phpt] XFAIL REASON: See Bug #48770 Bug #48770 (call_user_func_array() fails to call parent from inheriting class) [Zend/tests/bug48770_2.phpt] XFAIL REASON: See Bug #48770 Bug #48770 (call_user_func_array() fails to call parent from inheriting class) [Zend/tests/bug48770_3.phpt] XFAIL REASON: See Bug #48770 Bug #64896 (Segfault with gc_collect_cycles using unserialize on certain objects) [Zend/tests/bug64896.phpt] XFAIL REASON: We can not fix this bug without a significant (performace slow down) change to gc Initial value of static var in method depends on the include time of the class definition [Zend/tests/method_static_var.phpt] XFAIL REASON: Maybe not a bug DateTime::add() -- fall type2 type3 [ext/date/tests/DateTime_add-fall-type2-type3.phpt] XFAIL REASON: Various bugs exist DateTime::add() -- fall type3 type2 [ext/date/tests/DateTime_add-fall-type3-type2.phpt] XFAIL REASON: Various bugs exist DateTime::add() -- fall type3 type3 [ext/date/tests/DateTime_add-fall-type3-type3.phpt] XFAIL REASON: Various bugs exist DateTime::add() -- spring type2 type3 [ext/date/tests/DateTime_add-spring-type2-type3.phpt] XFAIL REASON: Various bugs exist DateTime::add() -- spring type3 type2 [ext/date/tests/DateTime_add-spring-type3-type2.phpt] XFAIL REASON: Various bugs exist DateTime::add() -- spring type3 type3 [ext/date/tests/DateTime_add-spring-type3-type3.phpt] XFAIL REASON: Various bugs exist DateTime::diff() -- fall type2 type3 [ext/date/tests/DateTime_diff-fall-type2-type3.phpt] XFAIL REASON: Various bugs exist DateTime::diff() -- fall type3 type2 [ext/date/tests/DateTime_diff-fall-type3-type2.phpt] XFAIL REASON: Various bugs exist DateTime::diff() -- fall type3 type3 [ext/date/tests/DateTime_diff-fall-type3-type3.phpt] XFAIL REASON: Various bugs exist DateTime::diff() -- spring type2 type3 [ext/date/tests/DateTime_diff-spring-type2-type3.phpt] XFAIL REASON: Various bugs exist DateTime::diff() -- spring type3 type2 [ext/date/tests/DateTime_diff-spring-type3-type2.phpt] XFAIL REASON: Various bugs exist DateTime::diff() -- spring type3 type3 [ext/date/tests/DateTime_diff-spring-type3-type3.phpt] XFAIL REASON: Various bugs exist DateTime::sub() -- fall type2 type3 [ext/date/tests/DateTime_sub-fall-type2-type3.phpt] XFAIL REASON: Various bugs exist DateTime::sub() -- fall type3 type2 [ext/date/tests/DateTime_sub-fall-type3-type2.phpt] XFAIL REASON: Various bugs exist DateTime::sub() -- fall type3 type3 [ext/date/tests/DateTime_sub-fall-type3-type3.phpt] XFAIL REASON: Various bugs exist DateTime::sub() -- spring type2 type3 [ext/date/tests/DateTime_sub-spring-type2-type3.phpt] XFAIL REASON: Various bugs exist DateTime::sub() -- spring type3 type2 [ext/date/tests/DateTime_sub-spring-type3-type2.phpt] XFAIL REASON: Various bugs exist DateTime::sub() -- spring type3 type3 [ext/date/tests/DateTime_sub-spring-type3-type3.phpt] XFAIL REASON: Various bugs exist RFC: DateTime and Daylight Saving Time Transitions (zone type 3, bd2) [ext/date/tests/rfc-datetime_and_daylight_saving_time-type3-bd2.phpt] XFAIL REASON: Still not quite right RFC: DateTime and Daylight Saving Time Transitions (zone type 3, fs) [ext/date/tests/rfc-datetime_and_daylight_saving_time-type3-fs.phpt] XFAIL REASON: Still not quite right Bug #42718 (unsafe_raw filter not applied when configured as default filter) [ext/filter/tests/bug42718.phpt] XFAIL REASON: FILTER_UNSAFE_RAW not applied when configured as default filter, even with flags Bug #67296 (filter_input doesn't validate variables) [ext/filter/tests/bug49184.phpt] XFAIL REASON: See Bug #49184 Bug #39858 (Lost connection to MySQL server during query by a repeated call stored proced) [ext/pdo_mysql/tests/bug_39858.phpt] XFAIL REASON: nextRowset() problem with stored proc & emulation mode & mysqlnd PDO MySQL Bug #41997 (stored procedure call returning single rowset blocks future queries) [ext/pdo_mysql/tests/bug_41997.phpt] XFAIL REASON: nextRowset() problem with stored proc & emulation mode & mysqlnd PECL Bug #7976 (Calling stored procedure several times) [ext/pdo_mysql/tests/bug_pecl_7976.phpt] XFAIL REASON: Works with mysqlnd. It is not supported by libmysql. For libmysql is good enough to see no crash. MySQL Prepared Statements and different column counts [ext/pdo_mysql/tests/pdo_mysql_stmt_variable_columncount.phpt] XFAIL REASON: nextRowset() problem with stored proc & emulation mode & mysqlnd ===================================================================== ===================================================================== FAILED TEST SUMMARY --------------------------------------------------------------------- Bug #30638 (localeconv returns wrong LC_NUMERIC settings) (ok to fail on MacOS X) [tests/lang/bug30638.phpt] Test open_basedir configuration [tests/security/open_basedir_is_executable.phpt] Test getdate() function : usage variation - Passing high positive and negative float values to timestamp. [ext/date/tests/getdate_variation7.phpt] Test localtime() function : usage variation - Passing higher positive and negetive float values to timestamp. [ext/date/tests/localtime_variation3.phpt] Bug #61411 (PDO Segfaults with PERSISTENT == TRUE && EMULATE_PREPARES == FALSE) [ext/pdo_mysql/tests/bug_61411.phpt] PDO::ATTR_ORACLE_NULLS [ext/pdo_mysql/tests/pdo_mysql_attr_oracle_nulls.phpt] MySQL PDO->exec(), affected rows [ext/pdo_mysql/tests/pdo_mysql_exec.phpt] MySQL PDO->exec(), affected rows [ext/pdo_mysql/tests/pdo_mysql_exec_load_data.phpt] Testing xpath() with invalid XML [ext/simplexml/tests/SimpleXMLElement_xpath.phpt] Test is_executable() function: usage variations - diff. path notations [ext/standard/tests/file/is_executable_variation1.phpt] Test mail() function : variation invalid program for sendmail [ext/standard/tests/mail/mail_variation1.phpt] Bug #64146 (serialize incorrectly saving objects when they are cloned) [ext/standard/tests/serialize/bug64146.phpt] Test setlocale() function : usage variations - Setting all available locales in the platform [ext/standard/tests/strings/setlocale_variation2.phpt] Test strptime() function : basic functionality [ext/standard/tests/time/strptime_basic.phpt] ===================================================================== ===================================================================== WARNED TEST SUMMARY --------------------------------------------------------------------- MySQL PDO->prepare(), emulated PS [ext/pdo_mysql/tests/pdo_mysql_prepare_emulated.phpt] (warn: XFAIL section but test passes) ===================================================================== ================================================================================ /usr/local/src/php-5.6.9/tests/lang/bug30638.phpt ================================================================================ decimal_point: , thousands_sep: ================================================================================ 002+ thousands_sep: 002- thousands_sep: . ================================================================================ ================================================================================ /usr/local/src/php-5.6.9/tests/security/open_basedir_is_executable.phpt ================================================================================ *** Testing open_basedir configuration [is_executable] *** bool(true) bool(true) bool(true) bool(true) bool(true) Warning: is_executable(): open_basedir restriction in effect. File(../bad) is not within the allowed path(s): (.) in /usr/local/src/php-5.6.9/tests/security/open_basedir.inc on line 78 bool(false) Warning: is_executable(): open_basedir restriction in effect. File(../bad/bad.txt) is not within the allowed path(s): (.) in /usr/local/src/php-5.6.9/tests/security/open_basedir.inc on line 79 bool(false) Warning: is_executable(): open_basedir restriction in effect. File(..) is not within the allowed path(s): (.) in /usr/local/src/php-5.6.9/tests/security/open_basedir.inc on line 80 bool(false) Warning: is_executable(): open_basedir restriction in effect. File(../) is not within the allowed path(s): (.) in /usr/local/src/php-5.6.9/tests/security/open_basedir.inc on line 81 bool(false) Warning: is_executable(): open_basedir restriction in effect. File(/) is not within the allowed path(s): (.) in /usr/local/src/php-5.6.9/tests/security/open_basedir.inc on line 82 bool(false) Warning: is_executable(): open_basedir restriction in effect. File(../bad/.) is not within the allowed path(s): (.) in /usr/local/src/php-5.6.9/tests/security/open_basedir.inc on line 83 bool(false) Warning: is_executable(): open_basedir restriction in effect. File(/usr/local/src/php-5.6.9/test/bad/bad.txt) is not within the allowed path(s): (.) in /usr/local/src/php-5.6.9/tests/security/open_basedir.inc on line 85 bool(false) Warning: is_executable(): open_basedir restriction in effect. File(/usr/local/src/php-5.6.9/test/bad/../bad/bad.txt) is not within the allowed path(s): (.) in /usr/local/src/php-5.6.9/tests/security/open_basedir.inc on line 86 bool(false) bool(true) bool(true) bool(true) bool(true) *** Finished testing open_basedir configuration [is_executable] *** ================================================================================ 031+ bool(true) 032+ bool(true) 033+ bool(true) 034+ bool(true) 031- bool(false) 032- bool(false) 033- bool(false) 034- bool(false) ================================================================================ ================================================================================ /usr/local/src/php-5.6.9/ext/date/tests/getdate_variation7.phpt ================================================================================ *** Testing getdate() : usage variation *** -- Testing getdate() function by passing float 12.3456789000e10 value to timestamp -- array(11) { ["seconds"]=> int(36) ["minutes"]=> int(43) ["hours"]=> int(10) ["mday"]=> int(26) ["wday"]=> int(2) ["mon"]=> int(3) ["year"]=> int(1935) ["yday"]=> int(84) ["weekday"]=> string(7) "Tuesday" ["month"]=> string(5) "March" [0]=> int(-1097262584) } -- Testing getdate() function by passing float -12.3456789000e10 value to timestamp -- array(11) { ["seconds"]=> int(44) ["minutes"]=> int(39) ["hours"]=> int(0) ["mday"]=> int(9) ["wday"]=> int(6) ["mon"]=> int(10) ["year"]=> int(2004) ["yday"]=> int(282) ["weekday"]=> string(8) "Saturday" ["month"]=> string(7) "October" [0]=> int(1097262584) } ===DONE=== ================================================================================ 040+ int(6) 040- int\(0\) 048+ string(8) "Saturday" 048- string\(6\) "Sunday" ================================================================================ ================================================================================ /usr/local/src/php-5.6.9/ext/date/tests/localtime_variation3.phpt ================================================================================ *** Testing localtime() : usage variation *** -- Testing localtime() function with 'float 12.3456789000e10' to timestamp -- array(9) { [0]=> int(16) [1]=> int(50) [2]=> int(4) [3]=> int(26) [4]=> int(2) [5]=> int(35) [6]=> int(2) [7]=> int(84) [8]=> int(0) } array(9) { ["tm_sec"]=> int(16) ["tm_min"]=> int(50) ["tm_hour"]=> int(4) ["tm_mday"]=> int(26) ["tm_mon"]=> int(2) ["tm_year"]=> int(35) ["tm_wday"]=> int(2) ["tm_yday"]=> int(84) ["tm_isdst"]=> int(0) } -- Testing localtime() function with 'float -12.3456789000e10' to timestamp -- array(9) { [0]=> int(44) [1]=> int(9) [2]=> int(19) [3]=> int(8) [4]=> int(9) [5]=> int(104) [6]=> int(5) [7]=> int(281) [8]=> int(0) } array(9) { ["tm_sec"]=> int(44) ["tm_min"]=> int(9) ["tm_hour"]=> int(19) ["tm_mday"]=> int(8) ["tm_mon"]=> int(9) ["tm_year"]=> int(104) ["tm_wday"]=> int(5) ["tm_yday"]=> int(281) ["tm_isdst"]=> int(0) } ===DONE=== ================================================================================ 060+ int(5) 060- int\(6\) 080+ int(5) 080- int\(6\) ================================================================================ ================================================================================ /usr/local/src/php-5.6.9/ext/pdo_mysql/tests/bug_61411.phpt ================================================================================ array(2) { [1]=> string(1) "1" [2]=> string(1) "1" } done! ================================================================================ 003+ string(1) "1" 003- int(1) 005+ string(1) "1" 005- int(1) ================================================================================ ================================================================================ /usr/local/src/php-5.6.9/ext/pdo_mysql/tests/pdo_mysql_attr_oracle_nulls.phpt ================================================================================ [002] Maybe PDO could indicate that this is not a proper way of setting ATTR_ORACLE_NULLS... [003] Maybe PDO could indicate that this is not a proper way of setting ATTR_ORACLE_NULLS... array(1) { [0]=> array(6) { ["z"]=> NULL ["a"]=> NULL ["b"]=> string(1) " " ["c"]=> NULL ["d"]=> string(2) " d" ["e"]=> string(3) "
===================================================================== EXPECTED FAILED TEST SUMMARY --------------------------------------------------------------------- Test open_basedir configuration [tests/security/open_basedir_linkinfo.phpt] XFAIL REASON: BUG: open_basedir cannot delete symlink to prohibited file. See also bugs 48111 and 52176. Inconsistencies when accessing protected members [Zend/tests/access_modifiers_008.phpt] XFAIL REASON: Discussion: http://marc.info/?l=php-internals&m=120221184420957&w=2 Inconsistencies when accessing protected members - 2 [Zend/tests/access_modifiers_009.phpt] XFAIL REASON: Discussion: http://marc.info/?l=php-internals&m=120221184420957&w=2 Bug #48770 (call_user_func_array() fails to call parent from inheriting class) [Zend/tests/bug48770.phpt] XFAIL REASON: See Bug #48770 Bug #48770 (call_user_func_array() fails to call parent from inheriting class) [Zend/tests/bug48770_2.phpt] XFAIL REASON: See Bug #48770 Bug #48770 (call_user_func_array() fails to call parent from inheriting class) [Zend/tests/bug48770_3.phpt] XFAIL REASON: See Bug #48770 Bug #64896 (Segfault with gc_collect_cycles using unserialize on certain objects) [Zend/tests/bug64896.phpt] XFAIL REASON: We can not fix this bug without a significant (performace slow down) change to gc Initial value of static var in method depends on the include time of the class definition [Zend/tests/method_static_var.phpt] XFAIL REASON: Maybe not a bug DateTime::add() -- fall type2 type3 [ext/date/tests/DateTime_add-fall-type2-type3.phpt] XFAIL REASON: Various bugs exist DateTime::add() -- fall type3 type2 [ext/date/tests/DateTime_add-fall-type3-type2.phpt] XFAIL REASON: Various bugs exist DateTime::add() -- fall type3 type3 [ext/date/tests/DateTime_add-fall-type3-type3.phpt] XFAIL REASON: Various bugs exist DateTime::add() -- spring type2 type3 [ext/date/tests/DateTime_add-spring-type2-type3.phpt] XFAIL REASON: Various bugs exist DateTime::add() -- spring type3 type2 [ext/date/tests/DateTime_add-spring-type3-type2.phpt] XFAIL REASON: Various bugs exist DateTime::add() -- spring type3 type3 [ext/date/tests/DateTime_add-spring-type3-type3.phpt] XFAIL REASON: Various bugs exist DateTime::diff() -- fall type2 type3 [ext/date/tests/DateTime_diff-fall-type2-type3.phpt] XFAIL REASON: Various bugs exist DateTime::diff() -- fall type3 type2 [ext/date/tests/DateTime_diff-fall-type3-type2.phpt] XFAIL REASON: Various bugs exist DateTime::diff() -- fall type3 type3 [ext/date/tests/DateTime_diff-fall-type3-type3.phpt] XFAIL REASON: Various bugs exist DateTime::diff() -- spring type2 type3 [ext/date/tests/DateTime_diff-spring-type2-type3.phpt] XFAIL REASON: Various bugs exist DateTime::diff() -- spring type3 type2 [ext/date/tests/DateTime_diff-spring-type3-type2.phpt] XFAIL REASON: Various bugs exist DateTime::diff() -- spring type3 type3 [ext/date/tests/DateTime_diff-spring-type3-type3.phpt] XFAIL REASON: Various bugs exist DateTime::sub() -- fall type2 type3 [ext/date/tests/DateTime_sub-fall-type2-type3.phpt] XFAIL REASON: Various bugs exist DateTime::sub() -- fall type3 type2 [ext/date/tests/DateTime_sub-fall-type3-type2.phpt] XFAIL REASON: Various bugs exist DateTime::sub() -- fall type3 type3 [ext/date/tests/DateTime_sub-fall-type3-type3.phpt] XFAIL REASON: Various bugs exist DateTime::sub() -- spring type2 type3 [ext/date/tests/DateTime_sub-spring-type2-type3.phpt] XFAIL REASON: Various bugs exist DateTime::sub() -- spring type3 type2 [ext/date/tests/DateTime_sub-spring-type3-type2.phpt] XFAIL REASON: Various bugs exist DateTime::sub() -- spring type3 type3 [ext/date/tests/DateTime_sub-spring-type3-type3.phpt] XFAIL REASON: Various bugs exist RFC: DateTime and Daylight Saving Time Transitions (zone type 3, bd2) [ext/date/tests/rfc-datetime_and_daylight_saving_time-type3-bd2.phpt] XFAIL REASON: Still not quite right RFC: DateTime and Daylight Saving Time Transitions (zone type 3, fs) [ext/date/tests/rfc-datetime_and_daylight_saving_time-type3-fs.phpt] XFAIL REASON: Still not quite right Bug #42718 (unsafe_raw filter not applied when configured as default filter) [ext/filter/tests/bug42718.phpt] XFAIL REASON: FILTER_UNSAFE_RAW not applied when configured as default filter, even with flags Bug #67296 (filter_input doesn't validate variables) [ext/filter/tests/bug49184.phpt] XFAIL REASON: See Bug #49184 Bug #39858 (Lost connection to MySQL server during query by a repeated call stored proced) [ext/pdo_mysql/tests/bug_39858.phpt] XFAIL REASON: nextRowset() problem with stored proc & emulation mode & mysqlnd PDO MySQL Bug #41997 (stored procedure call returning single rowset blocks future queries) [ext/pdo_mysql/tests/bug_41997.phpt] XFAIL REASON: nextRowset() problem with stored proc & emulation mode & mysqlnd PECL Bug #7976 (Calling stored procedure several times) [ext/pdo_mysql/tests/bug_pecl_7976.phpt] XFAIL REASON: Works with mysqlnd. It is not supported by libmysql. For libmysql is good enough to see no crash. MySQL Prepared Statements and different column counts [ext/pdo_mysql/tests/pdo_mysql_stmt_variable_columncount.phpt] XFAIL REASON: nextRowset() problem with stored proc & emulation mode & mysqlnd ===================================================================== ===================================================================== FAILED TEST SUMMARY --------------------------------------------------------------------- Bug #30638 (localeconv returns wrong LC_NUMERIC settings) (ok to fail on MacOS X) [tests/lang/bug30638.phpt] Test open_basedir configuration [tests/security/open_basedir_is_executable.phpt] Test getdate() function : usage variation - Passing high positive and negative float values to timestamp. [ext/date/tests/getdate_variation7.phpt] Test localtime() function : usage variation - Passing higher positive and negetive float values to timestamp. [ext/date/tests/localtime_variation3.phpt] Bug #61411 (PDO Segfaults with PERSISTENT == TRUE && EMULATE_PREPARES == FALSE) [ext/pdo_mysql/tests/bug_61411.phpt] PDO::ATTR_ORACLE_NULLS [ext/pdo_mysql/tests/pdo_mysql_attr_oracle_nulls.phpt] MySQL PDO->exec(), affected rows [ext/pdo_mysql/tests/pdo_mysql_exec.phpt] MySQL PDO->exec(), affected rows [ext/pdo_mysql/tests/pdo_mysql_exec_load_data.phpt] Testing xpath() with invalid XML [ext/simplexml/tests/SimpleXMLElement_xpath.phpt] Test is_executable() function: usage variations - diff. path notations [ext/standard/tests/file/is_executable_variation1.phpt] Test mail() function : variation invalid program for sendmail [ext/standard/tests/mail/mail_variation1.phpt] Bug #64146 (serialize incorrectly saving objects when they are cloned) [ext/standard/tests/serialize/bug64146.phpt] Test setlocale() function : usage variations - Setting all available locales in the platform [ext/standard/tests/strings/setlocale_variation2.phpt] Test strptime() function : basic functionality [ext/standard/tests/time/strptime_basic.phpt] ===================================================================== ===================================================================== WARNED TEST SUMMARY --------------------------------------------------------------------- MySQL PDO->prepare(), emulated PS [ext/pdo_mysql/tests/pdo_mysql_prepare_emulated.phpt] (warn: XFAIL section but test passes) ===================================================================== ===================================================================== TEST RESULT SUMMARY --------------------------------------------------------------------- Exts skipped : 51 Exts tested : 28 --------------------------------------------------------------------- Number of tests : 13589 9039 Tests skipped : 4550 ( 33.5%) -------- Tests warned : 1 ( 0.0%) ( 0.0%) Tests failed : 14 ( 0.1%) ( 0.2%) Expected fail : 34 ( 0.3%) ( 0.4%) Tests passed : 8990 ( 66.2%) ( 99.5%) --------------------------------------------------------------------- Time taken : 497 seconds ===================================================================== ===================================================================== EXPECTED FAILED TEST SUMMARY --------------------------------------------------------------------- Test open_basedir configuration [tests/security/open_basedir_linkinfo.phpt] XFAIL REASON: BUG: open_basedir cannot delete symlink to prohibited file. See also bugs 48111 and 52176. Inconsistencies when accessing protected members [Zend/tests/access_modifiers_008.phpt] XFAIL REASON: Discussion: http://marc.info/?l=php-internals&m=120221184420957&w=2 Inconsistencies when accessing protected members - 2 [Zend/tests/access_modifiers_009.phpt] XFAIL REASON: Discussion: http://marc.info/?l=php-internals&m=120221184420957&w=2 Bug #48770 (call_user_func_array() fails to call parent from inheriting class) [Zend/tests/bug48770.phpt] XFAIL REASON: See Bug #48770 Bug #48770 (call_user_func_array() fails to call parent from inheriting class) [Zend/tests/bug48770_2.phpt] XFAIL REASON: See Bug #48770 Bug #48770 (call_user_func_array() fails to call parent from inheriting class) [Zend/tests/bug48770_3.phpt] XFAIL REASON: See Bug #48770 Bug #64896 (Segfault with gc_collect_cycles using unserialize on certain objects) [Zend/tests/bug64896.phpt] XFAIL REASON: We can not fix this bug without a significant (performace slow down) change to gc Initial value of static var in method depends on the include time of the class definition [Zend/tests/method_static_var.phpt] XFAIL REASON: Maybe not a bug DateTime::add() -- fall type2 type3 [ext/date/tests/DateTime_add-fall-type2-type3.phpt] XFAIL REASON: Various bugs exist DateTime::add() -- fall type3 type2 [ext/date/tests/DateTime_add-fall-type3-type2.phpt] XFAIL REASON: Various bugs exist DateTime::add() -- fall type3 type3 [ext/date/tests/DateTime_add-fall-type3-type3.phpt] XFAIL REASON: Various bugs exist DateTime::add() -- spring type2 type3 [ext/date/tests/DateTime_add-spring-type2-type3.phpt] XFAIL REASON: Various bugs exist DateTime::add() -- spring type3 type2 [ext/date/tests/DateTime_add-spring-type3-type2.phpt] XFAIL REASON: Various bugs exist DateTime::add() -- spring type3 type3 [ext/date/tests/DateTime_add-spring-type3-type3.phpt] XFAIL REASON: Various bugs exist DateTime::diff() -- fall type2 type3 [ext/date/tests/DateTime_diff-fall-type2-type3.phpt] XFAIL REASON: Various bugs exist DateTime::diff() -- fall type3 type2 [ext/date/tests/DateTime_diff-fall-type3-type2.phpt] XFAIL REASON: Various bugs exist DateTime::diff() -- fall type3 type3 [ext/date/tests/DateTime_diff-fall-type3-type3.phpt] XFAIL REASON: Various bugs exist DateTime::diff() -- spring type2 type3 [ext/date/tests/DateTime_diff-spring-type2-type3.phpt] XFAIL REASON: Various bugs exist DateTime::diff() -- spring type3 type2 [ext/date/tests/DateTime_diff-spring-type3-type2.phpt] XFAIL REASON: Various bugs exist DateTime::diff() -- spring type3 type3 [ext/date/tests/DateTime_diff-spring-type3-type3.phpt] XFAIL REASON: Various bugs exist DateTime::sub() -- fall type2 type3 [ext/date/tests/DateTime_sub-fall-type2-type3.phpt] XFAIL REASON: Various bugs exist DateTime::sub() -- fall type3 type2 [ext/date/tests/DateTime_sub-fall-type3-type2.phpt] XFAIL REASON: Various bugs exist DateTime::sub() -- fall type3 type3 [ext/date/tests/DateTime_sub-fall-type3-type3.phpt] XFAIL REASON: Various bugs exist DateTime::sub() -- spring type2 type3 [ext/date/tests/DateTime_sub-spring-type2-type3.phpt] XFAIL REASON: Various bugs exist DateTime::sub() -- spring type3 type2 [ext/date/tests/DateTime_sub-spring-type3-type2.phpt] XFAIL REASON: Various bugs exist DateTime::sub() -- spring type3 type3 [ext/date/tests/DateTime_sub-spring-type3-type3.phpt] XFAIL REASON: Various bugs exist RFC: DateTime and Daylight Saving Time Transitions (zone type 3, bd2) [ext/date/tests/rfc-datetime_and_daylight_saving_time-type3-bd2.phpt] XFAIL REASON: Still not quite right RFC: DateTime and Daylight Saving Time Transitions (zone type 3, fs) [ext/date/tests/rfc-datetime_and_daylight_saving_time-type3-fs.phpt] XFAIL REASON: Still not quite right Bug #42718 (unsafe_raw filter not applied when configured as default filter) [ext/filter/tests/bug42718.phpt] XFAIL REASON: FILTER_UNSAFE_RAW not applied when configured as default filter, even with flags Bug #67296 (filter_input doesn't validate variables) [ext/filter/tests/bug49184.phpt] XFAIL REASON: See Bug #49184 Bug #39858 (Lost connection to MySQL server during query by a repeated call stored proced) [ext/pdo_mysql/tests/bug_39858.phpt] XFAIL REASON: nextRowset() problem with stored proc & emulation mode & mysqlnd PDO MySQL Bug #41997 (stored procedure call returning single rowset blocks future queries) [ext/pdo_mysql/tests/bug_41997.phpt] XFAIL REASON: nextRowset() problem with stored proc & emulation mode & mysqlnd PECL Bug #7976 (Calling stored procedure several times) [ext/pdo_mysql/tests/bug_pecl_7976.phpt] XFAIL REASON: Works with mysqlnd. It is not supported by libmysql. For libmysql is good enough to see no crash. MySQL Prepared Statements and different column counts [ext/pdo_mysql/tests/pdo_mysql_stmt_variable_columncount.phpt] XFAIL REASON: nextRowset() problem with stored proc & emulation mode & mysqlnd ===================================================================== ===================================================================== FAILED TEST SUMMARY --------------------------------------------------------------------- Bug #30638 (localeconv returns wrong LC_NUMERIC settings) (ok to fail on MacOS X) [tests/lang/bug30638.phpt] Test open_basedir configuration [tests/security/open_basedir_is_executable.phpt] Test getdate() function : usage variation - Passing high positive and negative float values to timestamp. [ext/date/tests/getdate_variation7.phpt] Test localtime() function : usage variation - Passing higher positive and negetive float values to timestamp. [ext/date/tests/localtime_variation3.phpt] Bug #61411 (PDO Segfaults with PERSISTENT == TRUE && EMULATE_PREPARES == FALSE) [ext/pdo_mysql/tests/bug_61411.phpt] PDO::ATTR_ORACLE_NULLS [ext/pdo_mysql/tests/pdo_mysql_attr_oracle_nulls.phpt] MySQL PDO->exec(), affected rows [ext/pdo_mysql/tests/pdo_mysql_exec.phpt] MySQL PDO->exec(), affected rows [ext/pdo_mysql/tests/pdo_mysql_exec_load_data.phpt] Testing xpath() with invalid XML [ext/simplexml/tests/SimpleXMLElement_xpath.phpt] Test is_executable() function: usage variations - diff. path notations [ext/standard/tests/file/is_executable_variation1.phpt] Test mail() function : variation invalid program for sendmail [ext/standard/tests/mail/mail_variation1.phpt] Bug #64146 (serialize incorrectly saving objects when they are cloned) [ext/standard/tests/serialize/bug64146.phpt] Test setlocale() function : usage variations - Setting all available locales in the platform [ext/standard/tests/strings/setlocale_variation2.phpt] Test strptime() function : basic functionality [ext/standard/tests/time/strptime_basic.phpt] ===================================================================== ===================================================================== WARNED TEST SUMMARY --------------------------------------------------------------------- MySQL PDO->prepare(), emulated PS [ext/pdo_mysql/tests/pdo_mysql_prepare_emulated.phpt] (warn: XFAIL section but test passes) ===================================================================== ================================================================================ /usr/local/src/php-5.6.9/tests/lang/bug30638.phpt ================================================================================ decimal_point: , thousands_sep: ================================================================================ 002+ thousands_sep: 002- thousands_sep: . ================================================================================ ================================================================================ /usr/local/src/php-5.6.9/tests/security/open_basedir_is_executable.phpt ================================================================================ *** Testing open_basedir configuration [is_executable] *** bool(true) bool(true) bool(true) bool(true) bool(true) Warning: is_executable(): open_basedir restriction in effect. File(../bad) is not within the allowed path(s): (.) in /usr/local/src/php-5.6.9/tests/security/open_basedir.inc on line 78 bool(false) Warning: is_executable(): open_basedir restriction in effect. File(../bad/bad.txt) is not within the allowed path(s): (.) in /usr/local/src/php-5.6.9/tests/security/open_basedir.inc on line 79 bool(false) Warning: is_executable(): open_basedir restriction in effect. File(..) is not within the allowed path(s): (.) in /usr/local/src/php-5.6.9/tests/security/open_basedir.inc on line 80 bool(false) Warning: is_executable(): open_basedir restriction in effect. File(../) is not within the allowed path(s): (.) in /usr/local/src/php-5.6.9/tests/security/open_basedir.inc on line 81 bool(false) Warning: is_executable(): open_basedir restriction in effect. File(/) is not within the allowed path(s): (.) in /usr/local/src/php-5.6.9/tests/security/open_basedir.inc on line 82 bool(false) Warning: is_executable(): open_basedir restriction in effect. File(../bad/.) is not within the allowed path(s): (.) in /usr/local/src/php-5.6.9/tests/security/open_basedir.inc on line 83 bool(false) Warning: is_executable(): open_basedir restriction in effect. File(/usr/local/src/php-5.6.9/test/bad/bad.txt) is not within the allowed path(s): (.) in /usr/local/src/php-5.6.9/tests/security/open_basedir.inc on line 85 bool(false) Warning: is_executable(): open_basedir restriction in effect. File(/usr/local/src/php-5.6.9/test/bad/../bad/bad.txt) is not within the allowed path(s): (.) in /usr/local/src/php-5.6.9/tests/security/open_basedir.inc on line 86 bool(false) bool(true) bool(true) bool(true) bool(true) *** Finished testing open_basedir configuration [is_executable] *** ================================================================================ 031+ bool(true) 032+ bool(true) 033+ bool(true) 034+ bool(true) 031- bool(false) 032- bool(false) 033- bool(false) 034- bool(false) ================================================================================ ================================================================================ /usr/local/src/php-5.6.9/ext/date/tests/getdate_variation7.phpt ================================================================================ *** Testing getdate() : usage variation *** -- Testing getdate() function by passing float 12.3456789000e10 value to timestamp -- array(11) { ["seconds"]=> int(36) ["minutes"]=> int(43) ["hours"]=> int(10) ["mday"]=> int(26) ["wday"]=> int(2) ["mon"]=> int(3) ["year"]=> int(1935) ["yday"]=> int(84) ["weekday"]=> string(7) "Tuesday" ["month"]=> string(5) "March" [0]=> int(-1097262584) } -- Testing getdate() function by passing float -12.3456789000e10 value to timestamp -- array(11) { ["seconds"]=> int(44) ["minutes"]=> int(39) ["hours"]=> int(0) ["mday"]=> int(9) ["wday"]=> int(6) ["mon"]=> int(10) ["year"]=> int(2004) ["yday"]=> int(282) ["weekday"]=> string(8) "Saturday" ["month"]=> string(7) "October" [0]=> int(1097262584) } ===DONE=== ================================================================================ 040+ int(6) 040- int\(0\) 048+ string(8) "Saturday" 048- string\(6\) "Sunday" ================================================================================ ================================================================================ /usr/local/src/php-5.6.9/ext/date/tests/localtime_variation3.phpt ================================================================================ *** Testing localtime() : usage variation *** -- Testing localtime() function with 'float 12.3456789000e10' to timestamp -- array(9) { [0]=> int(16) [1]=> int(50) [2]=> int(4) [3]=> int(26) [4]=> int(2) [5]=> int(35) [6]=> int(2) [7]=> int(84) [8]=> int(0) } array(9) { ["tm_sec"]=> int(16) ["tm_min"]=> int(50) ["tm_hour"]=> int(4) ["tm_mday"]=> int(26) ["tm_mon"]=> int(2) ["tm_year"]=> int(35) ["tm_wday"]=> int(2) ["tm_yday"]=> int(84) ["tm_isdst"]=> int(0) } -- Testing localtime() function with 'float -12.3456789000e10' to timestamp -- array(9) { [0]=> int(44) [1]=> int(9) [2]=> int(19) [3]=> int(8) [4]=> int(9) [5]=> int(104) [6]=> int(5) [7]=> int(281) [8]=> int(0) } array(9) { ["tm_sec"]=> int(44) ["tm_min"]=> int(9) ["tm_hour"]=> int(19) ["tm_mday"]=> int(8) ["tm_mon"]=> int(9) ["tm_year"]=> int(104) ["tm_wday"]=> int(5) ["tm_yday"]=> int(281) ["tm_isdst"]=> int(0) } ===DONE=== ================================================================================ 060+ int(5) 060- int\(6\) 080+ int(5) 080- int\(6\) ================================================================================ ================================================================================ /usr/local/src/php-5.6.9/ext/pdo_mysql/tests/bug_61411.phpt ================================================================================ array(2) { [1]=> string(1) "1" [2]=> string(1) "1" } done! ================================================================================ 003+ string(1) "1" 003- int(1) 005+ string(1) "1" 005- int(1) ================================================================================ ================================================================================ /usr/local/src/php-5.6.9/ext/pdo_mysql/tests/pdo_mysql_attr_oracle_nulls.phpt ================================================================================ [002] Maybe PDO could indicate that this is not a proper way of setting ATTR_ORACLE_NULLS... [003] Maybe PDO could indicate that this is not a proper way of setting ATTR_ORACLE_NULLS... array(1) { [0]=> array(6) { ["z"]=> NULL ["a"]=> NULL ["b"]=> string(1) " " ["c"]=> NULL ["d"]=> string(2) " d" ["e"]=> string(3) "