PHP 7.0.14 test failure on btrfs

From: Date: Sat, 28 Jan 2017 08:26:15 +0000
Subject: PHP 7.0.14 test failure on btrfs
Groups: php.qa.reports 
Request: Send a blank email to php-qa-reports+get-33931@lists.php.net to get a copy of this message
Greetings! While working on distro packaging for GNU Guix, I found that PHP 7.0.14 fails a few tests on Linux 4.9.5 while using the btrfs filesystem, but not while using ext4. I've attached the php_test_results file as requested by the test suite.

===================================================================== EXPECTED FAILED TEST SUMMARY --------------------------------------------------------------------- Test open_basedir configuration [tests/security/open_basedir_linkinfo.phpt] XFAIL REASON: BUG: open_basedir cannot delete symlink to prohibited file. See also bugs 48111 and 52176. Inconsistencies when accessing protected members [Zend/tests/access_modifiers_008.phpt] XFAIL REASON: Discussion: http://marc.info/?l=php-internals&m=120221184420957&w=2 Inconsistencies when accessing protected members - 2 [Zend/tests/access_modifiers_009.phpt] XFAIL REASON: Discussion: http://marc.info/?l=php-internals&m=120221184420957&w=2 Bug #48770 (call_user_func_array() fails to call parent from inheriting class) [Zend/tests/bug48770.phpt] XFAIL REASON: See Bug #48770 Bug #48770 (call_user_func_array() fails to call parent from inheriting class) [Zend/tests/bug48770_2.phpt] XFAIL REASON: See Bug #48770 Bug #48770 (call_user_func_array() fails to call parent from inheriting class) [Zend/tests/bug48770_3.phpt] XFAIL REASON: See Bug #48770 bug #71428.1: inheritance with null default values [Zend/tests/bug71428.1.phpt] XFAIL REASON: This is a BC break bug #71428: Validation type inheritance with = NULL [Zend/tests/bug71428.3.phpt] XFAIL REASON: This is a BC break Initial value of static var in method depends on the include time of the class definition [Zend/tests/method_static_var.phpt] XFAIL REASON: Maybe not a bug Bug #70228 (memleak if return in finally block) [Zend/tests/try/bug70228.phpt] XFAIL REASON: See https://bugs.php.net/bug.php?id=70228 DateTime::add() -- fall type2 type3 [ext/date/tests/DateTime_add-fall-type2-type3.phpt] XFAIL REASON: Various bugs exist DateTime::add() -- fall type3 type2 [ext/date/tests/DateTime_add-fall-type3-type2.phpt] XFAIL REASON: Various bugs exist DateTime::add() -- fall type3 type3 [ext/date/tests/DateTime_add-fall-type3-type3.phpt] XFAIL REASON: Various bugs exist DateTime::add() -- spring type2 type3 [ext/date/tests/DateTime_add-spring-type2-type3.phpt] XFAIL REASON: Various bugs exist DateTime::add() -- spring type3 type2 [ext/date/tests/DateTime_add-spring-type3-type2.phpt] XFAIL REASON: Various bugs exist DateTime::add() -- spring type3 type3 [ext/date/tests/DateTime_add-spring-type3-type3.phpt] XFAIL REASON: Various bugs exist DateTime::diff() -- fall type2 type3 [ext/date/tests/DateTime_diff-fall-type2-type3.phpt] XFAIL REASON: Various bugs exist DateTime::diff() -- fall type3 type2 [ext/date/tests/DateTime_diff-fall-type3-type2.phpt] XFAIL REASON: Various bugs exist DateTime::diff() -- fall type3 type3 [ext/date/tests/DateTime_diff-fall-type3-type3.phpt] XFAIL REASON: Various bugs exist DateTime::diff() -- spring type2 type3 [ext/date/tests/DateTime_diff-spring-type2-type3.phpt] XFAIL REASON: Various bugs exist DateTime::diff() -- spring type3 type2 [ext/date/tests/DateTime_diff-spring-type3-type2.phpt] XFAIL REASON: Various bugs exist DateTime::diff() -- spring type3 type3 [ext/date/tests/DateTime_diff-spring-type3-type3.phpt] XFAIL REASON: Various bugs exist DateTime::sub() -- fall type2 type3 [ext/date/tests/DateTime_sub-fall-type2-type3.phpt] XFAIL REASON: Various bugs exist DateTime::sub() -- fall type3 type2 [ext/date/tests/DateTime_sub-fall-type3-type2.phpt] XFAIL REASON: Various bugs exist DateTime::sub() -- fall type3 type3 [ext/date/tests/DateTime_sub-fall-type3-type3.phpt] XFAIL REASON: Various bugs exist DateTime::sub() -- spring type2 type3 [ext/date/tests/DateTime_sub-spring-type2-type3.phpt] XFAIL REASON: Various bugs exist DateTime::sub() -- spring type3 type2 [ext/date/tests/DateTime_sub-spring-type3-type2.phpt] XFAIL REASON: Various bugs exist DateTime::sub() -- spring type3 type3 [ext/date/tests/DateTime_sub-spring-type3-type3.phpt] XFAIL REASON: Various bugs exist Bug #55407 (Impossible to prototype DateTime::createFromFormat) [ext/date/tests/bug55407.phpt] XFAIL REASON: Bug #55407 RFC: DateTime and Daylight Saving Time Transitions (zone type 3, bd2) [ext/date/tests/rfc-datetime_and_daylight_saving_time-type3-bd2.phpt] XFAIL REASON: Still not quite right RFC: DateTime and Daylight Saving Time Transitions (zone type 3, fs) [ext/date/tests/rfc-datetime_and_daylight_saving_time-type3-fs.phpt] XFAIL REASON: Still not quite right Bug #42718 (unsafe_raw filter not applied when configured as default filter) [ext/filter/tests/bug42718.phpt] XFAIL REASON: FILTER_UNSAFE_RAW not applied when configured as default filter, even with flags Bug #67296 (filter_input doesn't validate variables) [ext/filter/tests/bug49184.phpt] XFAIL REASON: See Bug #49184 Bug #67167: filter_var(null,FILTER_VALIDATE_BOOLEAN,FILTER_NULL_ON_FAILURE) returns null [ext/filter/tests/bug67167.02.phpt] XFAIL REASON: Requires php_zval_filter to not use convert_to_string for all filters. Bug #73279 (Integer overflow in gdImageScaleBilinearPalette()) [ext/gd/tests/bug73279_old.phpt] XFAIL REASON: Bug #330 has not yet been fixed Phar: bug #69958: Segfault in Phar::convertToData on invalid file [ext/phar/tests/bug69958.phpt] XFAIL REASON: Still has memory leaks, see https://bugs.php.net/bug.php?id=70005 Bug #69111 Crash in SessionHandler::read() [ext/session/tests/bug69111.phpt] XFAIL REASON: It is still a leak Test basic function : variation3 use_trans_sid [ext/session/tests/session_basic3.phpt] XFAIL REASON: Waiting url_scanner_ex.re fix. https://bugs.php.net/bug.php?id=68970 Bug #70219 Use after free vulnerability in session deserializer [ext/standard/tests/serialize/bug70219.phpt] XFAIL REASON: Unfinished merge, needs fix. Bug #70470 (Built-in server truncates headers spanning over TCP packets) [sapi/cli/tests/bug70470.phpt] XFAIL REASON: bug is not fixed yet FPM: Test various messages on start, from master and childs [sapi/fpm/tests/015.phpt] XFAIL REASON: randomly intermittently failing all the time in CI, ERROR: unable to read what child say: Bad file descriptor (9) catch_workers_output = yes seems not reliable ===================================================================== ===================================================================== FAILED TEST SUMMARY --------------------------------------------------------------------- Test disk_free_space and its alias diskfreespace() functions : basic functionality [ext/standard/tests/file/disk_free_space_basic.phpt] Test lstat() and stat() functions: usage variations - creating file/subdir [ext/standard/tests/file/lstat_stat_variation8.phpt] Test lstat() and stat() functions: usage variations - deleting file/subdir [ext/standard/tests/file/lstat_stat_variation9.phpt] ===================================================================== ===================================================================== WARNED TEST SUMMARY --------------------------------------------------------------------- Temporary leak on exception [Zend/tests/temporary_cleaning_001.phpt] (warn: XFAIL section but test passes) Fundamental memory leak test on temporaries [Zend/tests/temporary_cleaning_003.phpt] (warn: XFAIL section but test passes) Temporary leak with switch [Zend/tests/temporary_cleaning_004.phpt] (warn: XFAIL section but test passes) Temporary leak with foreach [Zend/tests/temporary_cleaning_005.phpt] (warn: XFAIL section but test passes) Exception after separation during indirect write to fcall result [Zend/tests/temporary_cleaning_006.phpt] (warn: XFAIL section but test passes) Bug #72663: Create an Unexpected Object and Don't Invoke __wakeup() in Deserialization [ext/standard/tests/strings/bug72663_3.phpt] (warn: XFAIL section but test passes) FPM: Test status page [sapi/fpm/tests/010.phpt] (warn: XFAIL section but test passes) ===================================================================== ===================================================================== TEST RESULT SUMMARY --------------------------------------------------------------------- Exts skipped : 26 Exts tested : 49 --------------------------------------------------------------------- Number of tests : 14780 11378 Tests skipped : 3402 ( 23.0%) -------- Tests warned : 7 ( 0.0%) ( 0.1%) Tests failed : 3 ( 0.0%) ( 0.0%) Expected fail : 41 ( 0.3%) ( 0.4%) Tests passed : 11327 ( 76.6%) ( 99.6%) --------------------------------------------------------------------- Time taken : 908 seconds ===================================================================== ===================================================================== EXPECTED FAILED TEST SUMMARY --------------------------------------------------------------------- Test open_basedir configuration [tests/security/open_basedir_linkinfo.phpt] XFAIL REASON: BUG: open_basedir cannot delete symlink to prohibited file. See also bugs 48111 and 52176. Inconsistencies when accessing protected members [Zend/tests/access_modifiers_008.phpt] XFAIL REASON: Discussion: http://marc.info/?l=php-internals&m=120221184420957&w=2 Inconsistencies when accessing protected members - 2 [Zend/tests/access_modifiers_009.phpt] XFAIL REASON: Discussion: http://marc.info/?l=php-internals&m=120221184420957&w=2 Bug #48770 (call_user_func_array() fails to call parent from inheriting class) [Zend/tests/bug48770.phpt] XFAIL REASON: See Bug #48770 Bug #48770 (call_user_func_array() fails to call parent from inheriting class) [Zend/tests/bug48770_2.phpt] XFAIL REASON: See Bug #48770 Bug #48770 (call_user_func_array() fails to call parent from inheriting class) [Zend/tests/bug48770_3.phpt] XFAIL REASON: See Bug #48770 bug #71428.1: inheritance with null default values [Zend/tests/bug71428.1.phpt] XFAIL REASON: This is a BC break bug #71428: Validation type inheritance with = NULL [Zend/tests/bug71428.3.phpt] XFAIL REASON: This is a BC break Initial value of static var in method depends on the include time of the class definition [Zend/tests/method_static_var.phpt] XFAIL REASON: Maybe not a bug Bug #70228 (memleak if return in finally block) [Zend/tests/try/bug70228.phpt] XFAIL REASON: See https://bugs.php.net/bug.php?id=70228 DateTime::add() -- fall type2 type3 [ext/date/tests/DateTime_add-fall-type2-type3.phpt] XFAIL REASON: Various bugs exist DateTime::add() -- fall type3 type2 [ext/date/tests/DateTime_add-fall-type3-type2.phpt] XFAIL REASON: Various bugs exist DateTime::add() -- fall type3 type3 [ext/date/tests/DateTime_add-fall-type3-type3.phpt] XFAIL REASON: Various bugs exist DateTime::add() -- spring type2 type3 [ext/date/tests/DateTime_add-spring-type2-type3.phpt] XFAIL REASON: Various bugs exist DateTime::add() -- spring type3 type2 [ext/date/tests/DateTime_add-spring-type3-type2.phpt] XFAIL REASON: Various bugs exist DateTime::add() -- spring type3 type3 [ext/date/tests/DateTime_add-spring-type3-type3.phpt] XFAIL REASON: Various bugs exist DateTime::diff() -- fall type2 type3 [ext/date/tests/DateTime_diff-fall-type2-type3.phpt] XFAIL REASON: Various bugs exist DateTime::diff() -- fall type3 type2 [ext/date/tests/DateTime_diff-fall-type3-type2.phpt] XFAIL REASON: Various bugs exist DateTime::diff() -- fall type3 type3 [ext/date/tests/DateTime_diff-fall-type3-type3.phpt] XFAIL REASON: Various bugs exist DateTime::diff() -- spring type2 type3 [ext/date/tests/DateTime_diff-spring-type2-type3.phpt] XFAIL REASON: Various bugs exist DateTime::diff() -- spring type3 type2 [ext/date/tests/DateTime_diff-spring-type3-type2.phpt] XFAIL REASON: Various bugs exist DateTime::diff() -- spring type3 type3 [ext/date/tests/DateTime_diff-spring-type3-type3.phpt] XFAIL REASON: Various bugs exist DateTime::sub() -- fall type2 type3 [ext/date/tests/DateTime_sub-fall-type2-type3.phpt] XFAIL REASON: Various bugs exist DateTime::sub() -- fall type3 type2 [ext/date/tests/DateTime_sub-fall-type3-type2.phpt] XFAIL REASON: Various bugs exist DateTime::sub() -- fall type3 type3 [ext/date/tests/DateTime_sub-fall-type3-type3.phpt] XFAIL REASON: Various bugs exist DateTime::sub() -- spring type2 type3 [ext/date/tests/DateTime_sub-spring-type2-type3.phpt] XFAIL REASON: Various bugs exist DateTime::sub() -- spring type3 type2 [ext/date/tests/DateTime_sub-spring-type3-type2.phpt] XFAIL REASON: Various bugs exist DateTime::sub() -- spring type3 type3 [ext/date/tests/DateTime_sub-spring-type3-type3.phpt] XFAIL REASON: Various bugs exist Bug #55407 (Impossible to prototype DateTime::createFromFormat) [ext/date/tests/bug55407.phpt] XFAIL REASON: Bug #55407 RFC: DateTime and Daylight Saving Time Transitions (zone type 3, bd2) [ext/date/tests/rfc-datetime_and_daylight_saving_time-type3-bd2.phpt] XFAIL REASON: Still not quite right RFC: DateTime and Daylight Saving Time Transitions (zone type 3, fs) [ext/date/tests/rfc-datetime_and_daylight_saving_time-type3-fs.phpt] XFAIL REASON: Still not quite right Bug #42718 (unsafe_raw filter not applied when configured as default filter) [ext/filter/tests/bug42718.phpt] XFAIL REASON: FILTER_UNSAFE_RAW not applied when configured as default filter, even with flags Bug #67296 (filter_input doesn't validate variables) [ext/filter/tests/bug49184.phpt] XFAIL REASON: See Bug #49184 Bug #67167: filter_var(null,FILTER_VALIDATE_BOOLEAN,FILTER_NULL_ON_FAILURE) returns null [ext/filter/tests/bug67167.02.phpt] XFAIL REASON: Requires php_zval_filter to not use convert_to_string for all filters. Bug #73279 (Integer overflow in gdImageScaleBilinearPalette()) [ext/gd/tests/bug73279_old.phpt] XFAIL REASON: Bug #330 has not yet been fixed Phar: bug #69958: Segfault in Phar::convertToData on invalid file [ext/phar/tests/bug69958.phpt] XFAIL REASON: Still has memory leaks, see https://bugs.php.net/bug.php?id=70005 Bug #69111 Crash in SessionHandler::read() [ext/session/tests/bug69111.phpt] XFAIL REASON: It is still a leak Test basic function : variation3 use_trans_sid [ext/session/tests/session_basic3.phpt] XFAIL REASON: Waiting url_scanner_ex.re fix. https://bugs.php.net/bug.php?id=68970 Bug #70219 Use after free vulnerability in session deserializer [ext/standard/tests/serialize/bug70219.phpt] XFAIL REASON: Unfinished merge, needs fix. Bug #70470 (Built-in server truncates headers spanning over TCP packets) [sapi/cli/tests/bug70470.phpt] XFAIL REASON: bug is not fixed yet FPM: Test various messages on start, from master and childs [sapi/fpm/tests/015.phpt] XFAIL REASON: randomly intermittently failing all the time in CI, ERROR: unable to read what child say: Bad file descriptor (9) catch_workers_output = yes seems not reliable ===================================================================== ===================================================================== FAILED TEST SUMMARY --------------------------------------------------------------------- Test disk_free_space and its alias diskfreespace() functions : basic functionality [ext/standard/tests/file/disk_free_space_basic.phpt] Test lstat() and stat() functions: usage variations - creating file/subdir [ext/standard/tests/file/lstat_stat_variation8.phpt] Test lstat() and stat() functions: usage variations - deleting file/subdir [ext/standard/tests/file/lstat_stat_variation9.phpt] ===================================================================== ===================================================================== WARNED TEST SUMMARY --------------------------------------------------------------------- Temporary leak on exception [Zend/tests/temporary_cleaning_001.phpt] (warn: XFAIL section but test passes) Fundamental memory leak test on temporaries [Zend/tests/temporary_cleaning_003.phpt] (warn: XFAIL section but test passes) Temporary leak with switch [Zend/tests/temporary_cleaning_004.phpt] (warn: XFAIL section but test passes) Temporary leak with foreach [Zend/tests/temporary_cleaning_005.phpt] (warn: XFAIL section but test passes) Exception after separation during indirect write to fcall result [Zend/tests/temporary_cleaning_006.phpt] (warn: XFAIL section but test passes) Bug #72663: Create an Unexpected Object and Don't Invoke __wakeup() in Deserialization [ext/standard/tests/strings/bug72663_3.phpt] (warn: XFAIL section but test passes) FPM: Test status page [sapi/fpm/tests/010.phpt] (warn: XFAIL section but test passes) ===================================================================== ================================================================================ /tmp/guix-build-php-7.0.14.drv-0/php-7.0.14/ext/standard/tests/file/disk_free_space_basic.phpt ================================================================================ *** Testing with existing directory *** float(37906399232) float(37906399232) *** Testing with newly created directory *** Free Space before writing to a file float(37906399232) Free Space after writing to a file float(37906399232) Free Space Value Is Incorrect float(37906399232) float(37906399232) *** Testing with Binary Input *** float(37906399232) --- Done --- ================================================================================ 012+ Free Space Value Is Incorrect 013+ float(37906399232) 014+ float(37906399232) 012- Free Space Value Is Correct ================================================================================ ================================================================================ /tmp/guix-build-php-7.0.14.drv-0/php-7.0.14/ext/standard/tests/file/lstat_stat_variation8.phpt ================================================================================ *** Testing stat() on dir after subdir and file is created in it *** bool(true) bool(true) Error: stat1 is not lesser than stat2 at key value: 3 Error: stat1 is not lesser than stat2 at key value: nlink Dumping stat array 1... array(26) { [0]=> int(38) [1]=> int(94319472) [2]=> int(16877) [3]=> int(1) [4]=> int(999) [5]=> int(999) [6]=> int(0) [7]=> int(0) [8]=> int(1485584785) [9]=> int(1485584785) [10]=> int(1485584785) [11]=> int(4096) [12]=> int(0) ["dev"]=> int(38) ["ino"]=> int(94319472) ["mode"]=> int(16877) ["nlink"]=> int(1) ["uid"]=> int(999) ["gid"]=> int(999) ["rdev"]=> int(0) ["size"]=> int(0) ["atime"]=> int(1485584785) ["mtime"]=> int(1485584785) ["ctime"]=> int(1485584785) ["blksize"]=> int(4096) ["blocks"]=> int(0) } Dumping stat array 2... array(26) { [0]=> int(38) [1]=> int(94319472) [2]=> int(16877) [3]=> int(1) [4]=> int(999) [5]=> int(999) [6]=> int(0) [7]=> int(108) [8]=> int(1485584785) [9]=> int(1485584787) [10]=> int(1485584787) [11]=> int(4096) [12]=> int(0) ["dev"]=> int(38) ["ino"]=> int(94319472) ["mode"]=> int(16877) ["nlink"]=> int(1) ["uid"]=> int(999) ["gid"]=> int(999) ["rdev"]=> int(0) ["size"]=> int(108) ["atime"]=> int(1485584785) ["mtime"]=> int(1485584787) ["ctime"]=> int(1485584787) ["blksize"]=> int(4096) ["blocks"]=> int(0) } bool(false) --- Done --- ================================================================================ 004+ Error: stat1 is not lesser than stat2 at key value: 3 005+ Error: stat1 is not lesser than stat2 at key value: nlink 004- bool(true) 006- --- Done --- 007+ Dumping stat array 1... 008+ array(26) { 009+ [0]=> 010+ int(38) 011+ [1]=> 012+ int(94319472) 013+ [2]=> 014+ int(16877) 015+ [3]=> 016+ int(1) 017+ [4]=> 018+ int(999) 019+ [5]=> 020+ int(999) 021+ [6]=> 022+ int(0) 023+ [7]=> 024+ int(0) 025+ [8]=> 026+ int(1485584785) 027+ [9]=> 028+ int(1485584785) 029+ [10]=> 030+ int(1485584785) 031+ [11]=> 032+ int(4096) 033+ [12]=> 034+ int(0) 035+ ["dev"]=> 036+ int(38) 037+ ["ino"]=> 038+ int(94319472) 039+ ["mode"]=> 040+ int(16877) 041+ ["nlink"]=> 042+ int(1) 043+ ["uid"]=> 044+ int(999) 045+ ["gid"]=> 046+ int(999) 047+ ["rdev"]=> 048+ int(0) 049+ ["size"]=> 050+ int(0) 051+ ["atime"]=> 052+ int(1485584785) 053+ ["mtime"]=> 054+ int(1485584785) 055+ ["ctime"]=> 056+ int(1485584785) 057+ ["blksize"]=> 058+ int(4096) 059+ ["blocks"]=> 060+ int(0) 061+ } 062+ 063+ Dumping stat array 2... 064+ array(26) { 065+ [0]=> 066+ int(38) 067+ [1]=> 068+ int(94319472) 069+ [2]=> 070+ int(16877) 071+ [3]=> 072+ int(1) 073+ [4]=> 074+ int(999) 075+ [5]=> 076+ int(999) 077+ [6]=> 078+ int(0) 079+ [7]=> 080+ int(108) 081+ [8]=> 082+ int(1485584785) 083+ [9]=> 084+ int(1485584787) 085+ [10]=> 086+ int(1485584787) 087+ [11]=> 088+ int(4096) 089+ [12]=> 090+ int(0) 091+ ["dev"]=> 092+ int(38) 093+ ["ino"]=> 094+ int(94319472) 095+ ["mode"]=> 096+ int(16877) 097+ ["nlink"]=> 098+ int(1) 099+ ["uid"]=> 100+ int(999) 101+ ["gid"]=> 102+ int(999) 103+ ["rdev"]=> 104+ int(0) 105+ ["size"]=> 106+ int(108) 107+ ["atime"]=> 108+ int(1485584785) 109+ ["mtime"]=> 110+ int(1485584787) 111+ ["ctime"]=> 112+ int(1485584787) 113+ ["blksize"]=> 114+ int(4096) 115+ ["blocks"]=> 116+ int(0) 117+ } 118+ bool(false) 119+ 120+ --- Done --- ================================================================================ ================================================================================ /tmp/guix-build-php-7.0.14.drv-0/php-7.0.14/ext/standard/tests/file/lstat_stat_variation9.phpt ================================================================================ *** Testing stat() for comparing stats after the deletion of subdir and file *** bool(true) bool(true) Error: stat1 is not greater than stat2 at key value: 3 Error: stat1 is not greater than stat2 at key value: nlink Dumping stat array 1... array(26) { [0]=> int(38) [1]=> int(94319484) [2]=> int(16877) [3]=> int(1) [4]=> int(999) [5]=> int(999) [6]=> int(0) [7]=> int(108) [8]=> int(1485584787) [9]=> int(1485584787) [10]=> int(1485584787) [11]=> int(4096) [12]=> int(0) ["dev"]=> int(38) ["ino"]=> int(94319484) ["mode"]=> int(16877) ["nlink"]=> int(1) ["uid"]=> int(999) ["gid"]=> int(999) ["rdev"]=> int(0) ["size"]=> int(108) ["atime"]=> int(1485584787) ["mtime"]=> int(1485584787) ["ctime"]=> int(1485584787) ["blksize"]=> int(4096) ["blocks"]=> int(0) } Dumping stat array 2... array(26) { [0]=> int(38) [1]=> int(94319484) [2]=> int(16877) [3]=> int(1) [4]=> int(999) [5]=> int(999) [6]=> int(0) [7]=> int(0) [8]=> int(1485584787) [9]=> int(1485584787) [10]=> int(1485584787) [11]=> int(4096) [12]=> int(0) ["dev"]=> int(38) ["ino"]=> int(94319484) ["mode"]=> int(16877) ["nlink"]=> int(1) ["uid"]=> int(999) ["gid"]=> int(999) ["rdev"]=> int(0) ["size"]=> int(0) ["atime"]=> int(1485584787) ["mtime"]=> int(1485584787) ["ctime"]=> int(1485584787) ["blksize"]=> int(4096) ["blocks"]=> int(0) } bool(false) --- Done --- ================================================================================ 004+ Error: stat1 is not greater than stat2 at key value: 3 005+ Error: stat1 is not greater than stat2 at key value: nlink 004- bool(true) 006- --- Done --- 007+ Dumping stat array 1... 008+ array(26) { 009+ [0]=> 010+ int(38) 011+ [1]=> 012+ int(94319484) 013+ [2]=> 014+ int(16877) 015+ [3]=> 016+ int(1) 017+ [4]=> 018+ int(999) 019+ [5]=> 020+ int(999) 021+ [6]=> 022+ int(0) 023+ [7]=> 024+ int(108) 025+ [8]=> 026+ int(1485584787) 027+ [9]=> 028+ int(1485584787) 029+ [10]=> 030+ int(1485584787) 031+ [11]=> 032+ int(4096) 033+ [12]=> 034+ int(0) 035+ ["dev"]=> 036+ int(38) 037+ ["ino"]=> 038+ int(94319484) 039+ ["mode"]=> 040+ int(16877) 041+ ["nlink"]=> 042+ int(1) 043+ ["uid"]=> 044+ int(999) 045+ ["gid"]=> 046+ int(999) 047+ ["rdev"]=> 048+ int(0) 049+ ["size"]=> 050+ int(108) 051+ ["atime"]=> 052+ int(1485584787) 053+ ["mtime"]=> 054+ int(1485584787) 055+ ["ctime"]=> 056+ int(1485584787) 057+ ["blksize"]=> 058+ int(4096) 059+ ["blocks"]=> 060+ int(0) 061+ } 062+ 063+ Dumping stat array 2... 064+ array(26) { 065+ [0]=> 066+ int(38) 067+ [1]=> 068+ int(94319484) 069+ [2]=> 070+ int(16877) 071+ [3]=> 072+ int(1) 073+ [4]=> 074+ int(999) 075+ [5]=> 076+ int(999) 077+ [6]=> 078+ int(0) 079+ [7]=> 080+ int(0) 081+ [8]=> 082+ int(1485584787) 083+ [9]=> 084+ int(1485584787) 085+ [10]=> 086+ int(1485584787) 087+ [11]=> 088+ int(4096) 089+ [12]=> 090+ int(0) 091+ ["dev"]=> 092+ int(38) 093+ ["ino"]=> 094+ int(94319484) 095+ ["mode"]=> 096+ int(16877) 097+ ["nlink"]=> 098+ int(1) 099+ ["uid"]=> 100+ int(999) 101+ ["gid"]=> 102+ int(999) 103+ ["rdev"]=> 104+ int(0) 105+ ["size"]=> 106+ int(0) 107+ ["atime"]=> 108+ int(1485584787) 109+ ["mtime"]=> 110+ int(1485584787) 111+ ["ctime"]=> 112+ int(1485584787) 113+ ["blksize"]=> 114+ int(4096) 115+ ["blocks"]=> 116+ int(0) 117+ } 118+ bool(false) 119+ 120+ --- Done --- ================================================================================ ================================================================================ BUILD ENVIRONMENT ================================================================================ OS: Linux - Linux localhost 4.9.5 #8 SMP Sat Jan 21 14:50:38 EST 2017 x86_64 Autoconf: Bundled Libtool: ltmain.sh (GNU libtool) 1.5.26 (1.1220.2.492 2008/01/30 06:40:56) Copyright (C) 2008 Free Software Foundation, Inc. This is free software; see the source for copying conditions. There is NO warranty; not even for MERCHANTABILITY or FITNESS FOR A PARTICULAR PURPOSE. System Libtool: N/A Compiler: Using built-in specs. COLLECT_GCC=gcc COLLECT_LTO_WRAPPER=/gnu/store/y1g6991kxvdk4vxhsq07r5saww30v8dq-gcc-4.9.4/libexec/gcc/x86_64-unknown-linux-gnu/4.9.4/lto-wrapper Target: x86_64-unknown-linux-gnu Configured with: Thread model: posix gcc version 4.9.4 (GCC) Bison: bison (GNU Bison) 3.0.4 Written by Robert Corbett and Richard Stallman. Copyright (C) 2015 Free Software Foundation, Inc. This is free software; see the source for copying conditions. There is NO warranty; not even for MERCHANTABILITY or FITNESS FOR A PARTICULAR PURPOSE. Libraries: linux-vdso.so.1 (0x00007ffff7ffa000) libcrypt.so.1 => /gnu/store/iwgi9001dmmihrjg4rqhd6pa6788prjw-glibc-2.24/lib/libcrypt.so.1 (0x00007ffff7ba3000) libexslt.so.0 => /gnu/store/a1n7dhcdwmawax3sgv75dkbsv9yd27pr-libxslt-1.1.29/lib/libexslt.so.0 (0x00007ffff798d000) libz.so.1 => /gnu/store/a64w9dq219a8d9k4mfz76mnzph9wsvfj-zlib-1.2.8/lib/libz.so.1 (0x00007ffff7772000) libm.so.6 => /gnu/store/iwgi9001dmmihrjg4rqhd6pa6788prjw-glibc-2.24/lib/libm.so.6 (0x00007ffff746c000) libdl.so.2 => /gnu/store/iwgi9001dmmihrjg4rqhd6pa6788prjw-glibc-2.24/lib/libdl.so.2 (0x00007ffff7268000) libtidy-0.99.so.0 => /gnu/store/87rcay953pf4nwn3911yvlwqvhrrgq4h-tidy-20091223/lib/libtidy-0.99.so.0 (0x00007ffff7008000) libreadline.so.7 => /gnu/store/k0x973sjylvi746ib2xn4v1hjp855qq1-readline-7.0/lib/libreadline.so.7 (0x00007ffff6dbe000) libncursesw.so.6 => /gnu/store/xydfiifs9slq0wv6n8j6p26icn2ihn88-ncurses-6.0/lib/libncursesw.so.6 (0x00007ffff6b4d000) libpspell.so.15 => /gnu/store/683xx2qh0b7vwyfrdhs9rvsjfgjy07rz-aspell-0.60.6.1/lib/libpspell.so.15 (0x00007ffff694b000) libaspell.so.15 => /gnu/store/683xx2qh0b7vwyfrdhs9rvsjfgjy07rz-aspell-0.60.6.1/lib/libaspell.so.15 (0x00007ffff6685000) libstdc++.so.6 => /gnu/store/cdi08kw7r6r684w8mk0xq0dkgpjhfpmd-gcc-4.9.4-lib/lib/libstdc++.so.6 (0x00007ffff637b000) libpq.so.5 => /gnu/store/awmx27f02la7sc4s63jxsdczclsf63gj-postgresql-9.5.5/lib/libpq.so.5 (0x00007ffff6152000) librt.so.1 => /gnu/store/iwgi9001dmmihrjg4rqhd6pa6788prjw-glibc-2.24/lib/librt.so.1 (0x00007ffff5f4a000) libonig.so.2 => /gnu/store/h28ngqp5h1cwzbgzvln20s6q7h7r98hk-oniguruma-5.9.6/lib/libonig.so.2 (0x00007ffff5ce1000) libgd.so.3 => /gnu/store/ir4ldfw5paaf7xg34xckysl8xy9sjpmg-gd-2.2.3/lib/libgd.so.3 (0x00007ffff5a7c000) libfontconfig.so.1 => /gnu/store/pkv2qqgprp4zxcqfspwwx81qm9lng0da-fontconfig-2.12.1/lib/libfontconfig.so.1 (0x00007ffff5839000) libexpat.so.1 => /gnu/store/ppk2n4xi6pzgchcfzl2p48yj7y4jvnjv-expat-2.2.0/lib/libexpat.so.1 (0x00007ffff560f000) libXpm.so.4 => /gnu/store/fsqc2k7irsrijfz41hi982b93an2zcpw-libxpm-3.5.12/lib/libXpm.so.4 (0x00007ffff53fd000) libX11.so.6 => /gnu/store/dgz1p150n6ffs54qq4rzyh9fx26lrsad-libx11-1.6.4/lib/libX11.so.6 (0x00007ffff50c0000) libxcb.so.1 => /gnu/store/gjvjkcpvpnk6nng4p11ms1gf8mdrzjr2-libxcb-1.11.1/lib/libxcb.so.1 (0x00007ffff4ea1000) libXau.so.6 => /gnu/store/ac3q2lp5y4wf6jbxvnk46dn17gfp84yg-libxau-1.0.8/lib/libXau.so.6 (0x00007ffff4c9d000) libXdmcp.so.6 => /gnu/store/sc8fxjbwfnzn7wyvdyqmkz6a068xnafl-libxdmcp-1.1.2/lib/libXdmcp.so.6 (0x00007ffff4a97000) libjpeg.so.9 => /gnu/store/0fv0ppzi9c4an7gy2kb07j0pi1jvfcaf-libjpeg-9b/lib/libjpeg.so.9 (0x00007ffff485c000) libwebp.so.6 => /gnu/store/rml0vaksi3ls1i0gp06p6h438701mrqz-libwebp-0.5.1/lib/libwebp.so.6 (0x00007ffff45fc000) libsqlite3.so.0 => /gnu/store/ra2x0w2ib17na09hn5c5mn1jxc8xyqmf-sqlite-3.15.1/lib/libsqlite3.so.0 (0x00007ffff432b000) libpthread.so.0 => /gnu/store/iwgi9001dmmihrjg4rqhd6pa6788prjw-glibc-2.24/lib/libpthread.so.0 (0x00007ffff410e000) libpcre.so.1 => /gnu/store/039b1nq0jn2dqykwx5hd1b85sr08fiyc-pcre-8.38/lib/libpcre.so.1 (0x00007ffff3e9f000) libnsl.so.1 => /gnu/store/iwgi9001dmmihrjg4rqhd6pa6788prjw-glibc-2.24/lib/libnsl.so.1 (0x00007ffff3c87000) libssl.so.1.0.0 => /gnu/store/liib5wid6rx9rkss78spc7wcqzwb1g2k-openssl-1.0.2j/lib/libssl.so.1.0.0 (0x00007ffff3a15000) libcrypto.so.1.0.0 => /gnu/store/liib5wid6rx9rkss78spc7wcqzwb1g2k-openssl-1.0.2j/lib/libcrypto.so.1.0.0 (0x00007ffff35c0000) libcurl.so.4 => /gnu/store/zl3rh35m8psblbw034l9bvssx5yqn7f5-curl-7.50.3/lib/libcurl.so.4 (0x00007ffff334d000) libssh2.so.1 => /gnu/store/k9rds2a8fbk7qn8dak5y6lwmyq7ds437-libssh2-1.7.0/lib/libssh2.so.1 (0x00007ffff3121000) libgcrypt.so.20 => /gnu/store/4pnp5scrgmjp21flaihmgbckwrz6z4g3-libgcrypt-1.7.3/lib/libgcrypt.so.20 (0x00007ffff2e16000) libgss.so.3 => /gnu/store/frw384qlpchk4bay9vg8vfm5cv2vihzf-gss-1.0.3/lib/libgss.so.3 (0x00007ffff2c0a000) libshishi.so.0 => /gnu/store/9x04znpg4i24j9q1gg1dbr1vnl05dibw-shishi-1.0.2/lib/libshishi.so.0 (0x00007ffff29aa000) libtasn1.so.6 => /gnu/store/zqp7lmw6dr31j3frsdjwar6wdrzivnqj-libtasn1-4.9/lib/libtasn1.so.6 (0x00007ffff2797000) libnettle.so.6 => /gnu/store/vik632ig65676k0azx25vlcf3457v65p-nettle-3.2/lib/libnettle.so.6 (0x00007ffff255f000) libhogweed.so.4 => /gnu/store/vik632ig65676k0azx25vlcf3457v65p-nettle-3.2/lib/libhogweed.so.4 (0x00007ffff232b000) libgmp.so.10 => /gnu/store/6k08nkddnrb15h5pwp1s0fa94mr1qas9-gmp-6.1.1/lib/libgmp.so.10 (0x00007ffff2099000) libgcrypt.so.11 => /gnu/store/knck0wwbi9drh009a1zch2gl37hpf3ib-libgcrypt-1.5.6/lib/libgcrypt.so.11 (0x00007ffff1e18000) libgpg-error.so.0 => /gnu/store/vhfgzz0j9ry060qvcbvyhcrj3ikvm1vv-libgpg-error-1.24/lib/libgpg-error.so.0 (0x00007ffff1c05000) libidn.so.11 => /gnu/store/2gqvbsd3kz1nl2s0kvyxxjc7fm0hf9l9-libidn-1.33/lib/libidn.so.11 (0x00007ffff19d1000) libldap-2.4.so.2 => /gnu/store/h338g4l4isiy1qh873w9112hggmkvdwf-openldap-2.4.44/lib/libldap-2.4.so.2 (0x00007ffff1789000) liblber-2.4.so.2 => /gnu/store/h338g4l4isiy1qh873w9112hggmkvdwf-openldap-2.4.44/lib/liblber-2.4.so.2 (0x00007ffff157a000) libresolv.so.2 => /gnu/store/iwgi9001dmmihrjg4rqhd6pa6788prjw-glibc-2.24/lib/libresolv.so.2 (0x00007ffff1363000) libsasl2.so.3 => /gnu/store/xvsww5q2j9g4csi2i2mkpjm09mywnb6g-cyrus-sasl-2.1.26/lib/libsasl2.so.3 (0x00007ffff1147000) libgnutls.so.30 => /gnu/store/pwqygjf0ywvnv96h83k4rghq2x1m3qay-gnutls-3.5.4/lib/libgnutls.so.30 (0x00007ffff0e01000) libfreetype.so.6 => /gnu/store/hmc1jiyr29mk9cl2d9j0jwf0dim1q76g-freetype-2.6.3/lib/libfreetype.so.6 (0x00007ffff0b55000) libpng16.so.16 => /gnu/store/hin7b7nq2jizd93089zzmjh7i4781j8j-libpng-1.6.25/lib/libpng16.so.16 (0x00007ffff0923000) libxslt.so.1 => /gnu/store/a1n7dhcdwmawax3sgv75dkbsv9yd27pr-libxslt-1.1.29/lib/libxslt.so.1 (0x00007ffff06e3000) libxml2.so.2 => /gnu/store/cgr9z8n3i7kzpsjxnsljby5spvzq836v-libxml2-2.9.4/lib/libxml2.so.2 (0x00007ffff037d000) liblzma.so.5 => /gnu/store/4yg6q1kp856m68arkpqc85hqgbffhpxf-xz-5.2.2/lib/liblzma.so.5 (0x00007ffff0157000) libgcc_s.so.1 => /gnu/store/cdi08kw7r6r684w8mk0xq0dkgpjhfpmd-gcc-4.9.4-lib/lib/libgcc_s.so.1 (0x00007fffeff40000) libc.so.6 => /gnu/store/iwgi9001dmmihrjg4rqhd6pa6788prjw-glibc-2.24/lib/libc.so.6 (0x00007fffefba1000) /gnu/store/iwgi9001dmmihrjg4rqhd6pa6788prjw-glibc-2.24/lib/ld-linux-x86-64.so.2 (0x00007ffff7ddb000) User's E-mail: ================================================================================ PHPINFO ================================================================================ phpinfo() PHP Version => 7.0.14 System => Linux localhost 4.9.5 #8 SMP Sat Jan 21 14:50:38 EST 2017 x86_64 Build Date => Jan 28 2017 06:10:56 Configure Command => (omitted) Server API => Command Line Interface Virtual Directory Support => disabled Configuration File (php.ini) Path => /gnu/store/bln302msasii0db9yx7lfq1yv3c51nlz-php-7.0.14/lib Loaded Configuration File => (none) Scan this dir for additional .ini files => (none) Additional .ini files parsed => (none) PHP API => 20151012 PHP Extension => 20151012 Zend Extension => 320151012 Zend Extension Build => API320151012,NTS PHP Extension Build => API20151012,NTS Debug Build => no Thread Safety => disabled Zend Signal Handling => disabled Zend Memory Manager => enabled Zend Multibyte Support => provided by mbstring IPv6 Support => enabled DTrace Support => disabled Registered PHP Streams => https, ftps, compress.zlib, compress.bzip2, php, file, glob, data, http, ftp, phar Registered Stream Socket Transports => tcp, udp, unix, udg, ssl, sslv3, tls, tlsv1.0, tlsv1.1, tlsv1.2 Registered Stream Filters => zlib.*, bzip2.*, convert.iconv.*, string.rot13, string.toupper, string.tolower, string.strip_tags, convert.*, consumed, dechunk This program makes use of the Zend Scripting Language Engine: Zend Engine v3.0.0, Copyright (c) 1998-2016 Zend Technologies _______________________________________________________________________ Configuration bz2 BZip2 Support => Enabled Stream Wrapper support => compress.bzip2:// Stream Filter support => bzip2.decompress, bzip2.compress BZip2 Version => 1.0.6, 6-Sept-2010 calendar Calendar support => enabled Core PHP Version => 7.0.14 Directive => Local Value => Master Value allow_url_fopen => On => On allow_url_include => Off => Off arg_separator.input => & => & arg_separator.output => & => & auto_append_file => no value => no value auto_globals_jit => On => On auto_prepend_file => no value => no value browscap => no value => no value default_charset => UTF-8 => UTF-8 default_mimetype => text/html => text/html disable_classes => no value => no value disable_functions => no value => no value display_errors => STDERR => STDERR display_startup_errors => Off => Off doc_root => no value => no value docref_ext => no value => no value docref_root => no value => no value enable_dl => On => On enable_post_data_reading => On => On error_append_string => no value => no value error_log => no value => no value error_prepend_string => no value => no value error_reporting => no value => no value exit_on_timeout => Off => Off expose_php => On => On extension_dir => /gnu/store/bln302msasii0db9yx7lfq1yv3c51nlz-php-7.0.14/lib/php/extensions/no-debug-non-zts-20151012 => /gnu/store/bln302msasii0db9yx7lfq1yv3c51nlz-php-7.0.14/lib/php/extensions/no-debug-non-zts-20151012 file_uploads => On => On highlight.comment => <font style="color: #FF8000">#FF8000</font> => <font style="color: #FF8000">#FF8000</font> highlight.default => <font style="color: #0000BB">#0000BB</font> => <font style="color: #0000BB">#0000BB</font> highlight.html => <font style="color: #000000">#000000</font> => <font style="color: #000000">#000000</font> highlight.keyword => <font style="color: #007700">#007700</font> => <font style="color: #007700">#007700</font> highlight.string => <font style="color: #DD0000">#DD0000</font> => <font style="color: #DD0000">#DD0000</font> html_errors => Off => Off ignore_repeated_errors => Off => Off ignore_repeated_source => Off => Off ignore_user_abort => Off => Off implicit_flush => On => On include_path => .:/gnu/store/bln302msasii0db9yx7lfq1yv3c51nlz-php-7.0.14/lib/php => .:/gnu/store/bln302msasii0db9yx7lfq1yv3c51nlz-php-7.0.14/lib/php input_encoding => no value => no value internal_encoding => no value => no value log_errors => Off => Off log_errors_max_len => 1024 => 1024 mail.add_x_header => Off => Off mail.force_extra_parameters => no value => no value mail.log => no value => no value max_execution_time => 0 => 0 max_file_uploads => 20 => 20 max_input_nesting_level => 64 => 64 max_input_time => -1 => -1 max_input_vars => 1000 => 1000 memory_limit => 128M => 128M open_basedir => no value => no value output_buffering => 0 => 0 output_encoding => no value => no value output_handler => no value => no value post_max_size => 8M => 8M precision => 14 => 14 realpath_cache_size => 16K => 16K realpath_cache_ttl => 120 => 120 register_argc_argv => On => On report_memleaks => On => On report_zend_debug => Off => Off request_order => no value => no value sendmail_from => no value => no value sendmail_path => -t -i => -t -i serialize_precision => 17 => 17 short_open_tag => On => On SMTP => localhost => localhost smtp_port => 25 => 25 sql.safe_mode => Off => Off sys_temp_dir => no value => no value track_errors => Off => Off unserialize_callback_func => no value => no value upload_max_filesize => 2M => 2M upload_tmp_dir => no value => no value user_dir => no value => no value user_ini.cache_ttl => 300 => 300 user_ini.filename => .user.ini => .user.ini variables_order => EGPCS => EGPCS xmlrpc_error_number => 0 => 0 xmlrpc_errors => Off => Off zend.assertions => 1 => 1 zend.detect_unicode => On => On zend.enable_gc => On => On zend.multibyte => Off => Off zend.script_encoding => no value => no value ctype ctype functions => enabled curl cURL support => enabled cURL Information => 7.50.3 Age => 3 Features AsynchDNS => No CharConv => No Debug => No GSS-Negotiate => No IDN => Yes IPv6 => Yes krb4 => No Largefile => Yes libz => Yes NTLM => Yes NTLMWB => Yes SPNEGO => Yes SSL => Yes SSPI => No TLS-SRP => Yes HTTP2 => No GSSAPI => Yes KERBEROS5 => Yes UNIX_SOCKETS => Yes PSL => No Protocols => dict, file, ftp, ftps, gopher, http, https, imap, imaps, ldap, ldaps, pop3, pop3s, rtsp, scp, sftp, smb, smbs, smtp, smtps, telnet, tftp Host => x86_64-unknown-linux-gnu SSL Version => GnuTLS/3.5.4 ZLib Version => 1.2.8 libSSH Version => libssh2/1.7.0 date date/time support => enabled "Olson" Timezone Database Version => 2016.9 Timezone Database => internal Default timezone => UTC Directive => Local Value => Master Value date.default_latitude => 31.7667 => 31.7667 date.default_longitude => 35.2333 => 35.2333 date.sunrise_zenith => 90.583333 => 90.583333 date.sunset_zenith => 90.583333 => 90.583333 date.timezone => no value => no value dom DOM/XML => enabled DOM/XML API Version => 20031129 libxml Version => 2.9.4 HTML Support => enabled XPath Support => enabled XPointer Support => enabled Schema Support => enabled RelaxNG Support => enabled exif EXIF Support => enabled EXIF Version => 1.4 $Id: 8bdc0c8f27c2c9dd1f7551f1f9fe3ab57a06a4b1 $ Supported EXIF Version => 0220 Supported filetypes => JPEG,TIFF Directive => Local Value => Master Value exif.decode_jis_intel => JIS => JIS exif.decode_jis_motorola => JIS => JIS exif.decode_unicode_intel => UCS-2LE => UCS-2LE exif.decode_unicode_motorola => UCS-2BE => UCS-2BE exif.encode_jis => no value => no value exif.encode_unicode => ISO-8859-15 => ISO-8859-15 fileinfo fileinfo support => enabled version => 1.0.5 libmagic => 522 filter Input Validation and Filtering => enabled Revision => $Id: 613c0b75ea13d5c3f89571bd253d16ac861b43fc $ Directive => Local Value => Master Value filter.default => unsafe_raw => unsafe_raw filter.default_flags => no value => no value ftp FTP support => enabled FTPS support => enabled gd GD Support => enabled GD headers Version => 2.2.3 GD library Version => 2.2.3 FreeType Support => enabled FreeType Linkage => with freetype FreeType Version => 2.6.3 GIF Read Support => enabled GIF Create Support => enabled JPEG Support => enabled libJPEG Version => unknown PNG Support => enabled libPNG Version => 1.6.25 WBMP Support => enabled XPM Support => enabled libXpm Version => 30411 XBM Support => enabled Directive => Local Value => Master Value gd.jpeg_ignore_warning => 0 => 0 gettext GetText Support => enabled gmp gmp support => enabled GMP version => 6.1.1 hash hash support => enabled Hashing Engines => md2 md4 md5 sha1 sha224 sha256 sha384 sha512 ripemd128 ripemd160 ripemd256 ripemd320 whirlpool tiger128,3 tiger160,3 tiger192,3 tiger128,4 tiger160,4 tiger192,4 snefru snefru256 gost gost-crypto adler32 crc32 crc32b fnv132 fnv1a32 fnv164 fnv1a64 joaat haval128,3 haval160,3 haval192,3 haval224,3 haval256,3 haval128,4 haval160,4 haval192,4 haval224,4 haval256,4 haval128,5 haval160,5 haval192,5 haval224,5 haval256,5 iconv iconv support => enabled iconv implementation => glibc iconv library version => 2.24 Directive => Local Value => Master Value iconv.input_encoding => no value => no value iconv.internal_encoding => no value => no value iconv.output_encoding => no value => no value json json support => enabled json version => 1.4.0 ldap LDAP Support => enabled RCS Version => $Id: e384f3c044b57ae590d48d1349dc1c478db63a22 $ Total Links => 0/unlimited API Version => 3001 Vendor Name => OpenLDAP Vendor Version => 20444 SASL Support => Enabled Directive => Local Value => Master Value ldap.max_links => Unlimited => Unlimited libxml libXML support => active libXML Compiled Version => 2.9.4 libXML Loaded Version => 20904 libXML streams => enabled mbstring Multibyte Support => enabled Multibyte string engine => libmbfl HTTP input encoding translation => disabled libmbfl version => 1.3.2 oniguruma version => 5.9.6 mbstring extension makes use of "streamable kanji code filter and converter", which is distributed under the GNU Lesser General Public License version 2.1. Multibyte (japanese) regex support => enabled Multibyte regex (oniguruma) version => 5.9.6 Directive => Local Value => Master Value mbstring.detect_order => no value => no value mbstring.encoding_translation => Off => Off mbstring.func_overload => 0 => 0 mbstring.http_input => no value => no value mbstring.http_output => no value => no value mbstring.http_output_conv_mimetypes => ^(text/|application/xhtml\+xml) => ^(text/|application/xhtml\+xml) mbstring.internal_encoding => no value => no value mbstring.language => neutral => neutral mbstring.strict_detection => Off => Off mbstring.substitute_character => no value => no value mysqlnd mysqlnd => enabled Version => mysqlnd 5.0.12-dev - 20150407 - $Id: 241ae00989d1995ffcbbf63d579943635faf9972 $ Compression => supported core SSL => supported extended SSL => supported Command buffer size => 4096 Read buffer size => 32768 Read timeout => 31536000 Collecting statistics => Yes Collecting memory statistics => No Tracing => n/a Loaded plugins => mysqlnd,debug_trace,auth_plugin_mysql_native_password,auth_plugin_mysql_clear_password,auth_plugin_sha256_password API Extensions => pdo_mysql mysqlnd statistics => bytes_sent => 0 bytes_received => 0 packets_sent => 0 packets_received => 0 protocol_overhead_in => 0 protocol_overhead_out => 0 bytes_received_ok_packet => 0 bytes_received_eof_packet => 0 bytes_received_rset_header_packet => 0 bytes_received_rset_field_meta_packet => 0 bytes_received_rset_row_packet => 0 bytes_received_prepare_response_packet => 0 bytes_received_change_user_packet => 0 packets_sent_command => 0 packets_received_ok => 0 packets_received_eof => 0 packets_received_rset_header => 0 packets_received_rset_field_meta => 0 packets_received_rset_row => 0 packets_received_prepare_response => 0 packets_received_change_user => 0 result_set_queries => 0 non_result_set_queries => 0 no_index_used => 0 bad_index_used => 0 slow_queries => 0 buffered_sets => 0 unbuffered_sets => 0 ps_buffered_sets => 0 ps_unbuffered_sets => 0 flushed_normal_sets => 0 flushed_ps_sets => 0 ps_prepared_never_executed => 0 ps_prepared_once_executed => 0 rows_fetched_from_server_normal => 0 rows_fetched_from_server_ps => 0 rows_buffered_from_client_normal => 0 rows_buffered_from_client_ps => 0 rows_fetched_from_client_normal_buffered => 0 rows_fetched_from_client_normal_unbuffered => 0 rows_fetched_from_client_ps_buffered => 0 rows_fetched_from_client_ps_unbuffered => 0 rows_fetched_from_client_ps_cursor => 0 rows_affected_normal => 0 rows_affected_ps => 0 rows_skipped_normal => 0 rows_skipped_ps => 0 copy_on_write_saved => 0 copy_on_write_performed => 0 command_buffer_too_small => 0 connect_success => 0 connect_failure => 0 connection_reused => 0 reconnect => 0 pconnect_success => 0 active_connections => 0 active_persistent_connections => 0 explicit_close => 0 implicit_close => 0 disconnect_close => 0 in_middle_of_command_close => 0 explicit_free_result => 0 implicit_free_result => 0 explicit_stmt_close => 0 implicit_stmt_close => 0 mem_emalloc_count => 0 mem_emalloc_amount => 0 mem_ecalloc_count => 0 mem_ecalloc_amount => 0 mem_erealloc_count => 0 mem_erealloc_amount => 0 mem_efree_count => 0 mem_efree_amount => 0 mem_malloc_count => 0 mem_malloc_amount => 0 mem_calloc_count => 0 mem_calloc_amount => 0 mem_realloc_count => 0 mem_realloc_amount => 0 mem_free_count => 0 mem_free_amount => 0 mem_estrndup_count => 0 mem_strndup_count => 0 mem_estndup_count => 0 mem_strdup_count => 0 proto_text_fetched_null => 0 proto_text_fetched_bit => 0 proto_text_fetched_tinyint => 0 proto_text_fetched_short => 0 proto_text_fetched_int24 => 0 proto_text_fetched_int => 0 proto_text_fetched_bigint => 0 proto_text_fetched_decimal => 0 proto_text_fetched_float => 0 proto_text_fetched_double => 0 proto_text_fetched_date => 0 proto_text_fetched_year => 0 proto_text_fetched_time => 0 proto_text_fetched_datetime => 0 proto_text_fetched_timestamp => 0 proto_text_fetched_string => 0 proto_text_fetched_blob => 0 proto_text_fetched_enum => 0 proto_text_fetched_set => 0 proto_text_fetched_geometry => 0 proto_text_fetched_other => 0 proto_binary_fetched_null => 0 proto_binary_fetched_bit => 0 proto_binary_fetched_tinyint => 0 proto_binary_fetched_short => 0 proto_binary_fetched_int24 => 0 proto_binary_fetched_int => 0 proto_binary_fetched_bigint => 0 proto_binary_fetched_decimal => 0 proto_binary_fetched_float => 0 proto_binary_fetched_double => 0 proto_binary_fetched_date => 0 proto_binary_fetched_year => 0 proto_binary_fetched_time => 0 proto_binary_fetched_datetime => 0 proto_binary_fetched_timestamp => 0 proto_binary_fetched_string => 0 proto_binary_fetched_json => 0 proto_binary_fetched_blob => 0 proto_binary_fetched_enum => 0 proto_binary_fetched_set => 0 proto_binary_fetched_geometry => 0 proto_binary_fetched_other => 0 init_command_executed_count => 0 init_command_failed_count => 0 com_quit => 0 com_init_db => 0 com_query => 0 com_field_list => 0 com_create_db => 0 com_drop_db => 0 com_refresh => 0 com_shutdown => 0 com_statistics => 0 com_process_info => 0 com_connect => 0 com_process_kill => 0 com_debug => 0 com_ping => 0 com_time => 0 com_delayed_insert => 0 com_change_user => 0 com_binlog_dump => 0 com_table_dump => 0 com_connect_out => 0 com_register_slave => 0 com_stmt_prepare => 0 com_stmt_execute => 0 com_stmt_send_long_data => 0 com_stmt_close => 0 com_stmt_reset => 0 com_stmt_set_option => 0 com_stmt_fetch => 0 com_deamon => 0 bytes_received_real_data_normal => 0 bytes_received_real_data_ps => 0 openssl OpenSSL support => enabled OpenSSL Library Version => OpenSSL 1.0.2j 26 Sep 2016 OpenSSL Header Version => OpenSSL 1.0.2j 26 Sep 2016 Openssl default config => /gnu/store/liib5wid6rx9rkss78spc7wcqzwb1g2k-openssl-1.0.2j/share/openssl-1.0.2j/openssl.cnf Directive => Local Value => Master Value openssl.cafile => no value => no value openssl.capath => no value => no value pcntl pcntl support => enabled pcre PCRE (Perl Compatible Regular Expressions) Support => enabled PCRE Library Version => 8.38 2015-11-23 PCRE JIT Support => enabled Directive => Local Value => Master Value pcre.backtrack_limit => 1000000 => 1000000 pcre.jit => 1 => 1 pcre.recursion_limit => 100000 => 100000 PDO PDO support => enabled PDO drivers => pgsql, sqlite, mysql pdo_mysql PDO Driver for MySQL => enabled Client API version => mysqlnd 5.0.12-dev - 20150407 - $Id: 241ae00989d1995ffcbbf63d579943635faf9972 $ Directive => Local Value => Master Value pdo_mysql.default_socket => /tmp/mysql.sock => /tmp/mysql.sock pdo_pgsql PDO Driver for PostgreSQL => enabled PostgreSQL(libpq) Version => 9.5.5 Module version => 7.0.14 Revision => $Id: f9b0c62eba234361d62f16fcbaaa120353ab5175 $ pdo_sqlite PDO Driver for SQLite 3.x => enabled SQLite Library => 3.15.1 pgsql PostgreSQL Support => enabled PostgreSQL(libpq) Version => 9.5.5 PostgreSQL(libpq) => PostgreSQL 9.5.5 on x86_64-unknown-linux-gnu, compiled by gcc (GCC) 4.9.4, 64-bit Multibyte character support => enabled SSL support => disabled Active Persistent Links => 0 Active Links => 0 Directive => Local Value => Master Value pgsql.allow_persistent => On => On pgsql.auto_reset_persistent => Off => Off pgsql.ignore_notice => Off => Off pgsql.log_notice => Off => Off pgsql.max_links => Unlimited => Unlimited pgsql.max_persistent => Unlimited => Unlimited Phar Phar: PHP Archive support => enabled Phar EXT version => 2.0.2 Phar API version => 1.1.1 SVN revision => $Id: 860f5132d446a7b24c2bbf050ce6949381ea8db5 $ Phar-based phar archives => enabled Tar-based phar archives => enabled ZIP-based phar archives => enabled gzip compression => enabled bzip2 compression => enabled Native OpenSSL support => enabled Phar based on pear/PHP_Archive, original concept by Davey Shafik. Phar fully realized by Gregory Beaver and Marcus Boerger. Portions of tar implementation Copyright (c) 2003-2009 Tim Kientzle. Directive => Local Value => Master Value phar.cache_list => no value => no value phar.readonly => On => On phar.require_hash => On => On posix Revision => $Id: 771e31632526e20243748d73c150d8977fff1781 $ pspell PSpell Support => enabled readline Readline Support => enabled Readline library => 7.0 Directive => Local Value => Master Value cli.pager => no value => no value cli.prompt => \b \> => \b \> Reflection Reflection => enabled Version => $Id: b24f9c691ddba60f618ecf2ba7ae131a76cfc722 $ session Session Support => enabled Registered save handlers => files user Registered serializer handlers => php_serialize php php_binary Directive => Local Value => Master Value session.auto_start => Off => Off session.cache_expire => 180 => 180 session.cache_limiter => nocache => nocache session.cookie_domain => no value => no value session.cookie_httponly => Off => Off session.cookie_lifetime => 0 => 0 session.cookie_path => / => / session.cookie_secure => Off => Off session.entropy_file => /dev/urandom => /dev/urandom session.entropy_length => 32 => 32 session.gc_divisor => 100 => 100 session.gc_maxlifetime => 1440 => 1440 session.gc_probability => 1 => 1 session.hash_bits_per_character => 4 => 4 session.hash_function => 0 => 0 session.lazy_write => On => On session.name => PHPSESSID => PHPSESSID session.referer_check => no value => no value session.save_handler => files => files session.save_path => no value => no value session.serialize_handler => php => php session.upload_progress.cleanup => On => On session.upload_progress.enabled => On => On session.upload_progress.freq => 1% => 1% session.upload_progress.min_freq => 1 => 1 session.upload_progress.name => PHP_SESSION_UPLOAD_PROGRESS => PHP_SESSION_UPLOAD_PROGRESS session.upload_progress.prefix => upload_progress_ => upload_progress_ session.use_cookies => On => On session.use_only_cookies => On => On session.use_strict_mode => Off => Off session.use_trans_sid => 0 => 0 SimpleXML Simplexml support => enabled Revision => $Id: a0c9e98a9e216920fcf75a02da085c9616b16cc8 $ Schema support => enabled sockets Sockets Support => enabled SPL SPL support => enabled Interfaces => Countable, OuterIterator, RecursiveIterator, SeekableIterator, SplObserver, SplSubject Classes => AppendIterator, ArrayIterator, ArrayObject, BadFunctionCallException, BadMethodCallException, CachingIterator, CallbackFilterIterator, DirectoryIterator, DomainException, EmptyIterator, FilesystemIterator, FilterIterator, GlobIterator, InfiniteIterator, InvalidArgumentException, IteratorIterator, LengthException, LimitIterator, LogicException, MultipleIterator, NoRewindIterator, OutOfBoundsException, OutOfRangeException, OverflowException, ParentIterator, RangeException, RecursiveArrayIterator, RecursiveCachingIterator, RecursiveCallbackFilterIterator, RecursiveDirectoryIterator, RecursiveFilterIterator, RecursiveIteratorIterator, RecursiveRegexIterator, RecursiveTreeIterator, RegexIterator, RuntimeException, SplDoublyLinkedList, SplFileInfo, SplFileObject, SplFixedArray, SplHeap, SplMinHeap, SplMaxHeap, SplObjectStorage, SplPriorityQueue, SplQueue, SplStack, SplTempFileObject, UnderflowException, UnexpectedValueException sqlite3 SQLite3 support => enabled SQLite3 module version => 0.7-dev SQLite Library => 3.15.1 Directive => Local Value => Master Value sqlite3.extension_dir => no value => no value standard Dynamic Library Support => enabled Path to sendmail => -t -i Directive => Local Value => Master Value assert.active => 1 => 1 assert.bail => 0 => 0 assert.callback => no value => no value assert.exception => 0 => 0 assert.quiet_eval => 0 => 0 assert.warning => 1 => 1 auto_detect_line_endings => 0 => 0 default_socket_timeout => 60 => 60 from => no value => no value url_rewriter.tags => a=href,area=href,frame=src,form=,fieldset= => a=href,area=href,frame=src,form=,fieldset= user_agent => no value => no value tidy Tidy support => enabled libTidy Release => 25 March 2009 Extension Version => 7.0.14 ($Id: c5d43b097bcd741ef0f8e424db7f1c5f5ce80e3a $) Directive => Local Value => Master Value tidy.clean_output => 0 => 0 tidy.default_config => no value => no value tokenizer Tokenizer Support => enabled xml XML Support => active XML Namespace Support => active libxml2 Version => 2.9.4 xmlreader XMLReader => enabled xmlwriter XMLWriter => enabled xsl XSL => enabled libxslt Version => 1.1.29 libxslt compiled against libxml Version => 2.9.4 EXSLT => enabled libexslt Version => 1.1.29 zlib ZLib Support => enabled Stream Wrapper => compress.zlib:// Stream Filter => zlib.inflate, zlib.deflate Compiled Version => 1.2.8 Linked Version => 1.2.8 Directive => Local Value => Master Value zlib.output_compression => Off => Off zlib.output_compression_level => -1 => -1 zlib.output_handler => no value => no value Additional Modules Module Name Environment Variable => Value LC_ALL => en_US.utf8 SSH_CONNECTION => deleted TEST_PHP_SRCDIR => /tmp/guix-build-php-7.0.14.drv-0/php-7.0.14 _ => /tmp/guix-build-php-7.0.14.drv-0/php-7.0.14/sapi/cli/php C_INCLUDE_PATH => /gnu/store/9cw2mj574gh8kmhjnv5rzyjj3dqvgqv5-procps-3.3.12/include:/gnu/store/d5nscny560slzpljixqzim6b8ms7hhv2-bzip2-1.0.6/include:/gnu/store/4yg6q1kp856m68arkpqc85hqgbffhpxf-xz-5.2.2/include:/gnu/store/06icf5h4z83mw5g17a58fy26z14dsj9z-file-5.28/include:/gnu/store/k03y1lfaj1xw0d7j2lxdil8ii5c67fdy-gawk-4.1.4/include:/gnu/store/c5ihjcdxsm9086323bn2j67v7z34lc1a-make-4.2.1/include:/gnu/store/4xxd00drj8gjcr84xdfna44qak2vhwmf-binutils-2.27/include:/gnu/store/y1g6991kxvdk4vxhsq07r5saww30v8dq-gcc-4.9.4/include:/gnu/store/iwgi9001dmmihrjg4rqhd6pa6788prjw-glibc-2.24/include:/gnu/store/683xx2qh0b7vwyfrdhs9rvsjfgjy07rz-aspell-0.60.6.1/include:/gnu/store/8mcfg4f9ncxjk5aqm0rc0yvvh9bpisdz-bzip2-1.0.6/include:/gnu/store/zl3rh35m8psblbw034l9bvssx5yqn7f5-curl-7.50.3/include:/gnu/store/xvsww5q2j9g4csi2i2mkpjm09mywnb6g-cyrus-sasl-2.1.26/include:/gnu/store/hmc1jiyr29mk9cl2d9j0jwf0dim1q76g-freetype-2.6.3/include:/gnu/store/ir4ldfw5paaf7xg34xckysl8xy9sjpmg-gd-2.2.3/include:/gnu/store/30q87g4yfk4vpy58j42g60xijgw1nfll-gdbm-1.12/include:/gnu/store/8dfvnp3x82f6dp4siph3z0zydy0y6p4v-glibc-2.24/include:/gnu/store/6k08nkddnrb15h5pwp1s0fa94mr1qas9-gmp-6.1.1/include:/gnu/store/4pnp5scrgmjp21flaihmgbckwrz6z4g3-libgcrypt-1.7.3/include:/gnu/store/0fv0ppzi9c4an7gy2kb07j0pi1jvfcaf-libjpeg-9b/include:/gnu/store/hin7b7nq2jizd93089zzmjh7i4781j8j-libpng-1.6.25/include:/gnu/store/rml0vaksi3ls1i0gp06p6h438701mrqz-libwebp-0.5.1/include:/gnu/store/cgr9z8n3i7kzpsjxnsljby5spvzq836v-libxml2-2.9.4/include:/gnu/store/fsqc2k7irsrijfz41hi982b93an2zcpw-libxpm-3.5.12/include:/gnu/store/a1n7dhcdwmawax3sgv75dkbsv9yd27pr-libxslt-1.1.29/include:/gnu/store/dgz1p150n6ffs54qq4rzyh9fx26lrsad-libx11-1.6.4/include:/gnu/store/h28ngqp5h1cwzbgzvln20s6q7h7r98hk-oniguruma-5.9.6/include:/gnu/store/h338g4l4isiy1qh873w9112hggmkvdwf-openldap-2.4.44/include:/gnu/store/liib5wid6rx9rkss78spc7wcqzwb1g2k-openssl-1.0.2j/include:/gnu/store/039b1nq0jn2dqykwx5hd1b85sr08fiyc-pcre-8.38/include:/gnu/store/awmx27f02la7sc4s63jxsdczclsf63gj-postgresql-9.5.5/include:/gnu/store/k0x973sjylvi746ib2xn4v1hjp855qq1-readline-7.0/include:/gnu/store/ra2x0w2ib17na09hn5c5mn1jxc8xyqmf-sqlite-3.15.1/include:/gnu/store/87rcay953pf4nwn3911yvlwqvhrrgq4h-tidy-20091223/include:/gnu/store/a64w9dq219a8d9k4mfz76mnzph9wsvfj-zlib-1.2.8/include:/gnu/store/zpkwh5b3b3hrlpckdpb0givgqg5rf8gn-gettext-minimal-0.19.8.1/include:/gnu/store/jc898psn5yc9s328nn8fya3sc2daf037-linux-libre-headers-4.4.18/include:/gnu/store/pkv2qqgprp4zxcqfspwwx81qm9lng0da-fontconfig-2.12.1/include:/gnu/store/5c2ipd35wb0z51sl7pm6za81g6h1v51b-linux-libre-headers-4.4.18/include:/gnu/store/vhfgzz0j9ry060qvcbvyhcrj3ikvm1vv-libgpg-error-1.24/include:/gnu/store/gjvjkcpvpnk6nng4p11ms1gf8mdrzjr2-libxcb-1.11.1/include:/gnu/store/jwb8gd9d71y5k691i251k5498pxib7pl-kbproto-1.0.7/include:/gnu/store/xydfiifs9slq0wv6n8j6p26icn2ihn88-ncurses-6.0/include:/gnu/store/ppk2n4xi6pzgchcfzl2p48yj7y4jvnjv-expat-2.2.0/include:/gnu/store/sc8fxjbwfnzn7wyvdyqmkz6a068xnafl-libxdmcp-1.1.2/include:/gnu/store/ac3q2lp5y4wf6jbxvnk46dn17gfp84yg-libxau-1.0.8/include:/gnu/store/jnkpy7blw1qsika8201bbf3zl640hy9k-xproto-7.0.29/include out => /gnu/store/bln302msasii0db9yx7lfq1yv3c51nlz-php-7.0.14 SKIP_ONLINE_TESTS => 1 REPORT_EXIT_STATUS => 1 SSH_AUTH_SOCK => deleted MFLAGS => -j1 CC => gcc GUIX_LOCPATH => /gnu/store/py9ff8syssr3d8a5nlkdp8kdglj20p1n-glibc-utf8-locales-2.24/lib/locale PWD => /tmp/guix-build-php-7.0.14.drv-0/php-7.0.14 HOME => /homeless-shelter TMP => /tmp/guix-build-php-7.0.14.drv-0 SSH_CLIENT => deleted NIX_STORE => /gnu/store TMPDIR => /tmp/guix-build-php-7.0.14.drv-0 LIBRARY_PATH => /gnu/store/s4i0g2xg23dz0a0l5slk251vq5jzpavp-bison-3.0.4/lib:/gnu/store/9cw2mj574gh8kmhjnv5rzyjj3dqvgqv5-procps-3.3.12/lib:/gnu/store/d5nscny560slzpljixqzim6b8ms7hhv2-bzip2-1.0.6/lib:/gnu/store/4yg6q1kp856m68arkpqc85hqgbffhpxf-xz-5.2.2/lib:/gnu/store/06icf5h4z83mw5g17a58fy26z14dsj9z-file-5.28/lib:/gnu/store/k03y1lfaj1xw0d7j2lxdil8ii5c67fdy-gawk-4.1.4/lib:/gnu/store/qkw4zrwfybxww8f56nkb6hggxambk89b-bash-4.4.0/lib:/gnu/store/4xxd00drj8gjcr84xdfna44qak2vhwmf-binutils-2.27/lib:/gnu/store/iwgi9001dmmihrjg4rqhd6pa6788prjw-glibc-2.24/lib:/gnu/store/py9ff8syssr3d8a5nlkdp8kdglj20p1n-glibc-utf8-locales-2.24/lib:/gnu/store/683xx2qh0b7vwyfrdhs9rvsjfgjy07rz-aspell-0.60.6.1/lib:/gnu/store/8mcfg4f9ncxjk5aqm0rc0yvvh9bpisdz-bzip2-1.0.6/lib:/gnu/store/zl3rh35m8psblbw034l9bvssx5yqn7f5-curl-7.50.3/lib:/gnu/store/xvsww5q2j9g4csi2i2mkpjm09mywnb6g-cyrus-sasl-2.1.26/lib:/gnu/store/hmc1jiyr29mk9cl2d9j0jwf0dim1q76g-freetype-2.6.3/lib:/gnu/store/ir4ldfw5paaf7xg34xckysl8xy9sjpmg-gd-2.2.3/lib:/gnu/store/30q87g4yfk4vpy58j42g60xijgw1nfll-gdbm-1.12/lib:/gnu/store/8dfvnp3x82f6dp4siph3z0zydy0y6p4v-glibc-2.24/lib:/gnu/store/6k08nkddnrb15h5pwp1s0fa94mr1qas9-gmp-6.1.1/lib:/gnu/store/4pnp5scrgmjp21flaihmgbckwrz6z4g3-libgcrypt-1.7.3/lib:/gnu/store/0fv0ppzi9c4an7gy2kb07j0pi1jvfcaf-libjpeg-9b/lib:/gnu/store/hin7b7nq2jizd93089zzmjh7i4781j8j-libpng-1.6.25/lib:/gnu/store/rml0vaksi3ls1i0gp06p6h438701mrqz-libwebp-0.5.1/lib:/gnu/store/cgr9z8n3i7kzpsjxnsljby5spvzq836v-libxml2-2.9.4/lib:/gnu/store/fsqc2k7irsrijfz41hi982b93an2zcpw-libxpm-3.5.12/lib:/gnu/store/a1n7dhcdwmawax3sgv75dkbsv9yd27pr-libxslt-1.1.29/lib:/gnu/store/dgz1p150n6ffs54qq4rzyh9fx26lrsad-libx11-1.6.4/lib:/gnu/store/h28ngqp5h1cwzbgzvln20s6q7h7r98hk-oniguruma-5.9.6/lib:/gnu/store/h338g4l4isiy1qh873w9112hggmkvdwf-openldap-2.4.44/lib:/gnu/store/liib5wid6rx9rkss78spc7wcqzwb1g2k-openssl-1.0.2j/lib:/gnu/store/039b1nq0jn2dqykwx5hd1b85sr08fiyc-pcre-8.38/lib:/gnu/store/awmx27f02la7sc4s63jxsdczclsf63gj-postgresql-9.5.5/lib:/gnu/store/k0x973sjylvi746ib2xn4v1hjp855qq1-readline-7.0/lib:/gnu/store/ra2x0w2ib17na09hn5c5mn1jxc8xyqmf-sqlite-3.15.1/lib:/gnu/store/87rcay953pf4nwn3911yvlwqvhrrgq4h-tidy-20091223/lib:/gnu/store/a64w9dq219a8d9k4mfz76mnzph9wsvfj-zlib-1.2.8/lib:/gnu/store/9kmlcadkj7y1ag0lc2jl9dajlq3m90zr-perl-5.24.0/lib:/gnu/store/xnhabcs7zqbgqzjvfxfzha2fc66m5mrz-perl-xml-parser-2.44/lib:/gnu/store/zpkwh5b3b3hrlpckdpb0givgqg5rf8gn-gettext-minimal-0.19.8.1/lib:/gnu/store/pkv2qqgprp4zxcqfspwwx81qm9lng0da-fontconfig-2.12.1/lib:/gnu/store/vhfgzz0j9ry060qvcbvyhcrj3ikvm1vv-libgpg-error-1.24/lib:/gnu/store/gjvjkcpvpnk6nng4p11ms1gf8mdrzjr2-libxcb-1.11.1/lib:/gnu/store/jwb8gd9d71y5k691i251k5498pxib7pl-kbproto-1.0.7/lib:/gnu/store/xydfiifs9slq0wv6n8j6p26icn2ihn88-ncurses-6.0/lib:/gnu/store/ppk2n4xi6pzgchcfzl2p48yj7y4jvnjv-expat-2.2.0/lib:/gnu/store/sc8fxjbwfnzn7wyvdyqmkz6a068xnafl-libxdmcp-1.1.2/lib:/gnu/store/ac3q2lp5y4wf6jbxvnk46dn17gfp84yg-libxau-1.0.8/lib:/gnu/store/ydal55jilkdc6vv2s7s9kvv1knl56ff6-libpthread-stubs-0.3/lib:/gnu/store/jnkpy7blw1qsika8201bbf3zl640hy9k-xproto-7.0.29/lib:/gnu/store/1z9rjq9rzqzbjrvhba9fj0nxqa94rn7f-util-macros-1.19.0/lib TERMINFO_DIRS => /gnu/store/xydfiifs9slq0wv6n8j6p26icn2ihn88-ncurses-6.0/share/terminfo SSH_TTY => deleted TEMPDIR => /tmp/guix-build-php-7.0.14.drv-0 PERL5LIB => /gnu/store/9kmlcadkj7y1ag0lc2jl9dajlq3m90zr-perl-5.24.0/lib/perl5/site_perl:/gnu/store/xnhabcs7zqbgqzjvfxfzha2fc66m5mrz-perl-xml-parser-2.44/lib/perl5/site_perl MAKELEVEL => 1 SHLVL => 2 NIX_BUILD_CORES => 1 SOURCE_DATE_EPOCH => 1 TEMP => /tmp/guix-build-php-7.0.14.drv-0 BASH_LOADABLES_PATH => /gnu/store/qkw4zrwfybxww8f56nkb6hggxambk89b-bash-4.4.0/lib/bash CPLUS_INCLUDE_PATH => /gnu/store/9cw2mj574gh8kmhjnv5rzyjj3dqvgqv5-procps-3.3.12/include:/gnu/store/d5nscny560slzpljixqzim6b8ms7hhv2-bzip2-1.0.6/include:/gnu/store/4yg6q1kp856m68arkpqc85hqgbffhpxf-xz-5.2.2/include:/gnu/store/06icf5h4z83mw5g17a58fy26z14dsj9z-file-5.28/include:/gnu/store/k03y1lfaj1xw0d7j2lxdil8ii5c67fdy-gawk-4.1.4/include:/gnu/store/c5ihjcdxsm9086323bn2j67v7z34lc1a-make-4.2.1/include:/gnu/store/4xxd00drj8gjcr84xdfna44qak2vhwmf-binutils-2.27/include:/gnu/store/y1g6991kxvdk4vxhsq07r5saww30v8dq-gcc-4.9.4/include:/gnu/store/iwgi9001dmmihrjg4rqhd6pa6788prjw-glibc-2.24/include:/gnu/store/683xx2qh0b7vwyfrdhs9rvsjfgjy07rz-aspell-0.60.6.1/include:/gnu/store/8mcfg4f9ncxjk5aqm0rc0yvvh9bpisdz-bzip2-1.0.6/include:/gnu/store/zl3rh35m8psblbw034l9bvssx5yqn7f5-curl-7.50.3/include:/gnu/store/xvsww5q2j9g4csi2i2mkpjm09mywnb6g-cyrus-sasl-2.1.26/include:/gnu/store/hmc1jiyr29mk9cl2d9j0jwf0dim1q76g-freetype-2.6.3/include:/gnu/store/ir4ldfw5paaf7xg34xckysl8xy9sjpmg-gd-2.2.3/include:/gnu/store/30q87g4yfk4vpy58j42g60xijgw1nfll-gdbm-1.12/include:/gnu/store/8dfvnp3x82f6dp4siph3z0zydy0y6p4v-glibc-2.24/include:/gnu/store/6k08nkddnrb15h5pwp1s0fa94mr1qas9-gmp-6.1.1/include:/gnu/store/4pnp5scrgmjp21flaihmgbckwrz6z4g3-libgcrypt-1.7.3/include:/gnu/store/0fv0ppzi9c4an7gy2kb07j0pi1jvfcaf-libjpeg-9b/include:/gnu/store/hin7b7nq2jizd93089zzmjh7i4781j8j-libpng-1.6.25/include:/gnu/store/rml0vaksi3ls1i0gp06p6h438701mrqz-libwebp-0.5.1/include:/gnu/store/cgr9z8n3i7kzpsjxnsljby5spvzq836v-libxml2-2.9.4/include:/gnu/store/fsqc2k7irsrijfz41hi982b93an2zcpw-libxpm-3.5.12/include:/gnu/store/a1n7dhcdwmawax3sgv75dkbsv9yd27pr-libxslt-1.1.29/include:/gnu/store/dgz1p150n6ffs54qq4rzyh9fx26lrsad-libx11-1.6.4/include:/gnu/store/h28ngqp5h1cwzbgzvln20s6q7h7r98hk-oniguruma-5.9.6/include:/gnu/store/h338g4l4isiy1qh873w9112hggmkvdwf-openldap-2.4.44/include:/gnu/store/liib5wid6rx9rkss78spc7wcqzwb1g2k-openssl-1.0.2j/include:/gnu/store/039b1nq0jn2dqykwx5hd1b85sr08fiyc-pcre-8.38/include:/gnu/store/awmx27f02la7sc4s63jxsdczclsf63gj-postgresql-9.5.5/include:/gnu/store/k0x973sjylvi746ib2xn4v1hjp855qq1-readline-7.0/include:/gnu/store/ra2x0w2ib17na09hn5c5mn1jxc8xyqmf-sqlite-3.15.1/include:/gnu/store/87rcay953pf4nwn3911yvlwqvhrrgq4h-tidy-20091223/include:/gnu/store/a64w9dq219a8d9k4mfz76mnzph9wsvfj-zlib-1.2.8/include:/gnu/store/zpkwh5b3b3hrlpckdpb0givgqg5rf8gn-gettext-minimal-0.19.8.1/include:/gnu/store/jc898psn5yc9s328nn8fya3sc2daf037-linux-libre-headers-4.4.18/include:/gnu/store/pkv2qqgprp4zxcqfspwwx81qm9lng0da-fontconfig-2.12.1/include:/gnu/store/5c2ipd35wb0z51sl7pm6za81g6h1v51b-linux-libre-headers-4.4.18/include:/gnu/store/vhfgzz0j9ry060qvcbvyhcrj3ikvm1vv-libgpg-error-1.24/include:/gnu/store/gjvjkcpvpnk6nng4p11ms1gf8mdrzjr2-libxcb-1.11.1/include:/gnu/store/jwb8gd9d71y5k691i251k5498pxib7pl-kbproto-1.0.7/include:/gnu/store/xydfiifs9slq0wv6n8j6p26icn2ihn88-ncurses-6.0/include:/gnu/store/ppk2n4xi6pzgchcfzl2p48yj7y4jvnjv-expat-2.2.0/include:/gnu/store/sc8fxjbwfnzn7wyvdyqmkz6a068xnafl-libxdmcp-1.1.2/include:/gnu/store/ac3q2lp5y4wf6jbxvnk46dn17gfp84yg-libxau-1.0.8/include:/gnu/store/jnkpy7blw1qsika8201bbf3zl640hy9k-xproto-7.0.29/include PATH => /gnu/store/gss5fk5yh86m6qm7avvnq06nv99pb4jr-pkg-config-0.29/bin:/gnu/store/s4i0g2xg23dz0a0l5slk251vq5jzpavp-bison-3.0.4/bin:/gnu/store/l6y1bsy3dj7jc1p8z8g1m03k5nqn4a1c-intltool-0.51.0/bin:/gnu/store/9cw2mj574gh8kmhjnv5rzyjj3dqvgqv5-procps-3.3.12/bin:/gnu/store/9cw2mj574gh8kmhjnv5rzyjj3dqvgqv5-procps-3.3.12/sbin:/gnu/store/9l52vcmb1ambc3ypf7nxn38ac0976yyf-tar-1.29/bin:/gnu/store/ginbign0swn8h69k3z4fy18r8pwq3rqx-gzip-1.8/bin:/gnu/store/d5nscny560slzpljixqzim6b8ms7hhv2-bzip2-1.0.6/bin:/gnu/store/4yg6q1kp856m68arkpqc85hqgbffhpxf-xz-5.2.2/bin:/gnu/store/06icf5h4z83mw5g17a58fy26z14dsj9z-file-5.28/bin:/gnu/store/g0lyirlbqday5n2n0n6lh6nmdxi8a45z-diffutils-3.5/bin:/gnu/store/fs49m4pvdf2v7kixf9sls8nmhvh40ajl-patch-2.7.5/bin:/gnu/store/9761yfpvyr1fcpjhry8pgb3f0k6kj8n4-sed-4.2.2/bin:/gnu/store/cz7dl482c1j6j5s4vh1pll4lzdl5sl6b-findutils-4.6.0/bin:/gnu/store/k03y1lfaj1xw0d7j2lxdil8ii5c67fdy-gawk-4.1.4/bin:/gnu/store/hb301wl5s7352vbn1vds85dhy32n0hkw-grep-2.25/bin:/gnu/store/9xfn6q7cxqxaxsv6kgiic9iygl2iv2ci-coreutils-8.25/bin:/gnu/store/c5ihjcdxsm9086323bn2j67v7z34lc1a-make-4.2.1/bin:/gnu/store/qkw4zrwfybxww8f56nkb6hggxambk89b-bash-4.4.0/bin:/gnu/store/c7lm5innppxm53bf5w7i99d59kjdyx27-ld-wrapper-0/bin:/gnu/store/4xxd00drj8gjcr84xdfna44qak2vhwmf-binutils-2.27/bin:/gnu/store/y1g6991kxvdk4vxhsq07r5saww30v8dq-gcc-4.9.4/bin:/gnu/store/iwgi9001dmmihrjg4rqhd6pa6788prjw-glibc-2.24/bin:/gnu/store/iwgi9001dmmihrjg4rqhd6pa6788prjw-glibc-2.24/sbin:/gnu/store/683xx2qh0b7vwyfrdhs9rvsjfgjy07rz-aspell-0.60.6.1/bin:/gnu/store/8mcfg4f9ncxjk5aqm0rc0yvvh9bpisdz-bzip2-1.0.6/bin:/gnu/store/zl3rh35m8psblbw034l9bvssx5yqn7f5-curl-7.50.3/bin:/gnu/store/xvsww5q2j9g4csi2i2mkpjm09mywnb6g-cyrus-sasl-2.1.26/sbin:/gnu/store/hmc1jiyr29mk9cl2d9j0jwf0dim1q76g-freetype-2.6.3/bin:/gnu/store/ir4ldfw5paaf7xg34xckysl8xy9sjpmg-gd-2.2.3/bin:/gnu/store/30q87g4yfk4vpy58j42g60xijgw1nfll-gdbm-1.12/bin:/gnu/store/8dfvnp3x82f6dp4siph3z0zydy0y6p4v-glibc-2.24/bin:/gnu/store/8dfvnp3x82f6dp4siph3z0zydy0y6p4v-glibc-2.24/sbin:/gnu/store/4pnp5scrgmjp21flaihmgbckwrz6z4g3-libgcrypt-1.7.3/bin:/gnu/store/0fv0ppzi9c4an7gy2kb07j0pi1jvfcaf-libjpeg-9b/bin:/gnu/store/hin7b7nq2jizd93089zzmjh7i4781j8j-libpng-1.6.25/bin:/gnu/store/rml0vaksi3ls1i0gp06p6h438701mrqz-libwebp-0.5.1/bin:/gnu/store/cgr9z8n3i7kzpsjxnsljby5spvzq836v-libxml2-2.9.4/bin:/gnu/store/fsqc2k7irsrijfz41hi982b93an2zcpw-libxpm-3.5.12/bin:/gnu/store/a1n7dhcdwmawax3sgv75dkbsv9yd27pr-libxslt-1.1.29/bin:/gnu/store/h28ngqp5h1cwzbgzvln20s6q7h7r98hk-oniguruma-5.9.6/bin:/gnu/store/h338g4l4isiy1qh873w9112hggmkvdwf-openldap-2.4.44/bin:/gnu/store/h338g4l4isiy1qh873w9112hggmkvdwf-openldap-2.4.44/sbin:/gnu/store/liib5wid6rx9rkss78spc7wcqzwb1g2k-openssl-1.0.2j/bin:/gnu/store/awmx27f02la7sc4s63jxsdczclsf63gj-postgresql-9.5.5/bin:/gnu/store/k0x973sjylvi746ib2xn4v1hjp855qq1-readline-7.0/bin:/gnu/store/ra2x0w2ib17na09hn5c5mn1jxc8xyqmf-sqlite-3.15.1/bin:/gnu/store/87rcay953pf4nwn3911yvlwqvhrrgq4h-tidy-20091223/bin:/gnu/store/c7svspffz4v5fcbkx53jzvw08b2n6plf-zip-3.0/bin:/gnu/store/pawyi1z8xabzg49cqymhply84701krq1-m4-1.4.17/bin:/gnu/store/9kmlcadkj7y1ag0lc2jl9dajlq3m90zr-perl-5.24.0/bin:/gnu/store/zpkwh5b3b3hrlpckdpb0givgqg5rf8gn-gettext-minimal-0.19.8.1/bin:/gnu/store/pkv2qqgprp4zxcqfspwwx81qm9lng0da-fontconfig-2.12.1/bin:/gnu/store/vhfgzz0j9ry060qvcbvyhcrj3ikvm1vv-libgpg-error-1.24/bin:/gnu/store/xydfiifs9slq0wv6n8j6p26icn2ihn88-ncurses-6.0/bin:/gnu/store/ppk2n4xi6pzgchcfzl2p48yj7y4jvnjv-expat-2.2.0/bin NIX_BUILD_TOP => /tmp/guix-build-php-7.0.14.drv-0 PKG_CONFIG_PATH => /gnu/store/9cw2mj574gh8kmhjnv5rzyjj3dqvgqv5-procps-3.3.12/lib/pkgconfig:/gnu/store/4yg6q1kp856m68arkpqc85hqgbffhpxf-xz-5.2.2/lib/pkgconfig:/gnu/store/zl3rh35m8psblbw034l9bvssx5yqn7f5-curl-7.50.3/lib/pkgconfig:/gnu/store/xvsww5q2j9g4csi2i2mkpjm09mywnb6g-cyrus-sasl-2.1.26/lib/pkgconfig:/gnu/store/hmc1jiyr29mk9cl2d9j0jwf0dim1q76g-freetype-2.6.3/lib/pkgconfig:/gnu/store/ir4ldfw5paaf7xg34xckysl8xy9sjpmg-gd-2.2.3/lib/pkgconfig:/gnu/store/hin7b7nq2jizd93089zzmjh7i4781j8j-libpng-1.6.25/lib/pkgconfig:/gnu/store/rml0vaksi3ls1i0gp06p6h438701mrqz-libwebp-0.5.1/lib/pkgconfig:/gnu/store/cgr9z8n3i7kzpsjxnsljby5spvzq836v-libxml2-2.9.4/lib/pkgconfig:/gnu/store/fsqc2k7irsrijfz41hi982b93an2zcpw-libxpm-3.5.12/lib/pkgconfig:/gnu/store/a1n7dhcdwmawax3sgv75dkbsv9yd27pr-libxslt-1.1.29/lib/pkgconfig:/gnu/store/dgz1p150n6ffs54qq4rzyh9fx26lrsad-libx11-1.6.4/lib/pkgconfig:/gnu/store/h28ngqp5h1cwzbgzvln20s6q7h7r98hk-oniguruma-5.9.6/lib/pkgconfig:/gnu/store/liib5wid6rx9rkss78spc7wcqzwb1g2k-openssl-1.0.2j/lib/pkgconfig:/gnu/store/039b1nq0jn2dqykwx5hd1b85sr08fiyc-pcre-8.38/lib/pkgconfig:/gnu/store/awmx27f02la7sc4s63jxsdczclsf63gj-postgresql-9.5.5/lib/pkgconfig:/gnu/store/ra2x0w2ib17na09hn5c5mn1jxc8xyqmf-sqlite-3.15.1/lib/pkgconfig:/gnu/store/a64w9dq219a8d9k4mfz76mnzph9wsvfj-zlib-1.2.8/lib/pkgconfig:/gnu/store/pkv2qqgprp4zxcqfspwwx81qm9lng0da-fontconfig-2.12.1/lib/pkgconfig:/gnu/store/gjvjkcpvpnk6nng4p11ms1gf8mdrzjr2-libxcb-1.11.1/lib/pkgconfig:/gnu/store/jwb8gd9d71y5k691i251k5498pxib7pl-kbproto-1.0.7/lib/pkgconfig:/gnu/store/ppk2n4xi6pzgchcfzl2p48yj7y4jvnjv-expat-2.2.0/lib/pkgconfig:/gnu/store/sc8fxjbwfnzn7wyvdyqmkz6a068xnafl-libxdmcp-1.1.2/lib/pkgconfig:/gnu/store/ac3q2lp5y4wf6jbxvnk46dn17gfp84yg-libxau-1.0.8/lib/pkgconfig:/gnu/store/ydal55jilkdc6vv2s7s9kvv1knl56ff6-libpthread-stubs-0.3/lib/pkgconfig:/gnu/store/jnkpy7blw1qsika8201bbf3zl640hy9k-xproto-7.0.29/lib/pkgconfig:/gnu/store/1z9rjq9rzqzbjrvhba9fj0nxqa94rn7f-util-macros-1.19.0/lib/pkgconfig MAKEFLAGS => -j1 TEST_PHP_EXECUTABLE => /tmp/guix-build-php-7.0.14.drv-0/php-7.0.14/sapi/cli/php PHP Variables Variable => Value $_SERVER['LC_ALL'] => en_US.utf8 $_SERVER['SSH_CONNECTION'] => deleted $_SERVER['TEST_PHP_SRCDIR'] => /tmp/guix-build-php-7.0.14.drv-0/php-7.0.14 $_SERVER['_'] => /tmp/guix-build-php-7.0.14.drv-0/php-7.0.14/sapi/cli/php $_SERVER['C_INCLUDE_PATH'] => /gnu/store/9cw2mj574gh8kmhjnv5rzyjj3dqvgqv5-procps-3.3.12/include:/gnu/store/d5nscny560slzpljixqzim6b8ms7hhv2-bzip2-1.0.6/include:/gnu/store/4yg6q1kp856m68arkpqc85hqgbffhpxf-xz-5.2.2/include:/gnu/store/06icf5h4z83mw5g17a58fy26z14dsj9z-file-5.28/include:/gnu/store/k03y1lfaj1xw0d7j2lxdil8ii5c67fdy-gawk-4.1.4/include:/gnu/store/c5ihjcdxsm9086323bn2j67v7z34lc1a-make-4.2.1/include:/gnu/store/4xxd00drj8gjcr84xdfna44qak2vhwmf-binutils-2.27/include:/gnu/store/y1g6991kxvdk4vxhsq07r5saww30v8dq-gcc-4.9.4/include:/gnu/store/iwgi9001dmmihrjg4rqhd6pa6788prjw-glibc-2.24/include:/gnu/store/683xx2qh0b7vwyfrdhs9rvsjfgjy07rz-aspell-0.60.6.1/include:/gnu/store/8mcfg4f9ncxjk5aqm0rc0yvvh9bpisdz-bzip2-1.0.6/include:/gnu/store/zl3rh35m8psblbw034l9bvssx5yqn7f5-curl-7.50.3/include:/gnu/store/xvsww5q2j9g4csi2i2mkpjm09mywnb6g-cyrus-sasl-2.1.26/include:/gnu/store/hmc1jiyr29mk9cl2d9j0jwf0dim1q76g-freetype-2.6.3/include:/gnu/store/ir4ldfw5paaf7xg34xckysl8xy9sjpmg-gd-2.2.3/include:/gnu/store/30q87g4yfk4vpy58j42g60xijgw1nfll-gdbm-1.12/include:/gnu/store/8dfvnp3x82f6dp4siph3z0zydy0y6p4v-glibc-2.24/include:/gnu/store/6k08nkddnrb15h5pwp1s0fa94mr1qas9-gmp-6.1.1/include:/gnu/store/4pnp5scrgmjp21flaihmgbckwrz6z4g3-libgcrypt-1.7.3/include:/gnu/store/0fv0ppzi9c4an7gy2kb07j0pi1jvfcaf-libjpeg-9b/include:/gnu/store/hin7b7nq2jizd93089zzmjh7i4781j8j-libpng-1.6.25/include:/gnu/store/rml0vaksi3ls1i0gp06p6h438701mrqz-libwebp-0.5.1/include:/gnu/store/cgr9z8n3i7kzpsjxnsljby5spvzq836v-libxml2-2.9.4/include:/gnu/store/fsqc2k7irsrijfz41hi982b93an2zcpw-libxpm-3.5.12/include:/gnu/store/a1n7dhcdwmawax3sgv75dkbsv9yd27pr-libxslt-1.1.29/include:/gnu/store/dgz1p150n6ffs54qq4rzyh9fx26lrsad-libx11-1.6.4/include:/gnu/store/h28ngqp5h1cwzbgzvln20s6q7h7r98hk-oniguruma-5.9.6/include:/gnu/store/h338g4l4isiy1qh873w9112hggmkvdwf-openldap-2.4.44/include:/gnu/store/liib5wid6rx9rkss78spc7wcqzwb1g2k-openssl-1.0.2j/include:/gnu/store/039b1nq0jn2dqykwx5hd1b85sr08fiyc-pcre-8.38/include:/gnu/store/awmx27f02la7sc4s63jxsdczclsf63gj-postgresql-9.5.5/include:/gnu/store/k0x973sjylvi746ib2xn4v1hjp855qq1-readline-7.0/include:/gnu/store/ra2x0w2ib17na09hn5c5mn1jxc8xyqmf-sqlite-3.15.1/include:/gnu/store/87rcay953pf4nwn3911yvlwqvhrrgq4h-tidy-20091223/include:/gnu/store/a64w9dq219a8d9k4mfz76mnzph9wsvfj-zlib-1.2.8/include:/gnu/store/zpkwh5b3b3hrlpckdpb0givgqg5rf8gn-gettext-minimal-0.19.8.1/include:/gnu/store/jc898psn5yc9s328nn8fya3sc2daf037-linux-libre-headers-4.4.18/include:/gnu/store/pkv2qqgprp4zxcqfspwwx81qm9lng0da-fontconfig-2.12.1/include:/gnu/store/5c2ipd35wb0z51sl7pm6za81g6h1v51b-linux-libre-headers-4.4.18/include:/gnu/store/vhfgzz0j9ry060qvcbvyhcrj3ikvm1vv-libgpg-error-1.24/include:/gnu/store/gjvjkcpvpnk6nng4p11ms1gf8mdrzjr2-libxcb-1.11.1/include:/gnu/store/jwb8gd9d71y5k691i251k5498pxib7pl-kbproto-1.0.7/include:/gnu/store/xydfiifs9slq0wv6n8j6p26icn2ihn88-ncurses-6.0/include:/gnu/store/ppk2n4xi6pzgchcfzl2p48yj7y4jvnjv-expat-2.2.0/include:/gnu/store/sc8fxjbwfnzn7wyvdyqmkz6a068xnafl-libxdmcp-1.1.2/include:/gnu/store/ac3q2lp5y4wf6jbxvnk46dn17gfp84yg-libxau-1.0.8/include:/gnu/store/jnkpy7blw1qsika8201bbf3zl640hy9k-xproto-7.0.29/include $_SERVER['out'] => /gnu/store/bln302msasii0db9yx7lfq1yv3c51nlz-php-7.0.14 $_SERVER['SKIP_ONLINE_TESTS'] => 1 $_SERVER['REPORT_EXIT_STATUS'] => 1 $_SERVER['SSH_AUTH_SOCK'] => deleted $_SERVER['MFLAGS'] => -j1 $_SERVER['CC'] => gcc $_SERVER['GUIX_LOCPATH'] => /gnu/store/py9ff8syssr3d8a5nlkdp8kdglj20p1n-glibc-utf8-locales-2.24/lib/locale $_SERVER['PWD'] => /tmp/guix-build-php-7.0.14.drv-0/php-7.0.14 $_SERVER['HOME'] => /homeless-shelter $_SERVER['TMP'] => /tmp/guix-build-php-7.0.14.drv-0 $_SERVER['SSH_CLIENT'] => deleted $_SERVER['NIX_STORE'] => /gnu/store $_SERVER['TMPDIR'] => /tmp/guix-build-php-7.0.14.drv-0 $_SERVER['LIBRARY_PATH'] => /gnu/store/s4i0g2xg23dz0a0l5slk251vq5jzpavp-bison-3.0.4/lib:/gnu/store/9cw2mj574gh8kmhjnv5rzyjj3dqvgqv5-procps-3.3.12/lib:/gnu/store/d5nscny560slzpljixqzim6b8ms7hhv2-bzip2-1.0.6/lib:/gnu/store/4yg6q1kp856m68arkpqc85hqgbffhpxf-xz-5.2.2/lib:/gnu/store/06icf5h4z83mw5g17a58fy26z14dsj9z-file-5.28/lib:/gnu/store/k03y1lfaj1xw0d7j2lxdil8ii5c67fdy-gawk-4.1.4/lib:/gnu/store/qkw4zrwfybxww8f56nkb6hggxambk89b-bash-4.4.0/lib:/gnu/store/4xxd00drj8gjcr84xdfna44qak2vhwmf-binutils-2.27/lib:/gnu/store/iwgi9001dmmihrjg4rqhd6pa6788prjw-glibc-2.24/lib:/gnu/store/py9ff8syssr3d8a5nlkdp8kdglj20p1n-glibc-utf8-locales-2.24/lib:/gnu/store/683xx2qh0b7vwyfrdhs9rvsjfgjy07rz-aspell-0.60.6.1/lib:/gnu/store/8mcfg4f9ncxjk5aqm0rc0yvvh9bpisdz-bzip2-1.0.6/lib:/gnu/store/zl3rh35m8psblbw034l9bvssx5yqn7f5-curl-7.50.3/lib:/gnu/store/xvsww5q2j9g4csi2i2mkpjm09mywnb6g-cyrus-sasl-2.1.26/lib:/gnu/store/hmc1jiyr29mk9cl2d9j0jwf0dim1q76g-freetype-2.6.3/lib:/gnu/store/ir4ldfw5paaf7xg34xckysl8xy9sjpmg-gd-2.2.3/lib:/gnu/store/30q87g4yfk4vpy58j42g60xijgw1nfll-gdbm-1.12/lib:/gnu/store/8dfvnp3x82f6dp4siph3z0zydy0y6p4v-glibc-2.24/lib:/gnu/store/6k08nkddnrb15h5pwp1s0fa94mr1qas9-gmp-6.1.1/lib:/gnu/store/4pnp5scrgmjp21flaihmgbckwrz6z4g3-libgcrypt-1.7.3/lib:/gnu/store/0fv0ppzi9c4an7gy2kb07j0pi1jvfcaf-libjpeg-9b/lib:/gnu/store/hin7b7nq2jizd93089zzmjh7i4781j8j-libpng-1.6.25/lib:/gnu/store/rml0vaksi3ls1i0gp06p6h438701mrqz-libwebp-0.5.1/lib:/gnu/store/cgr9z8n3i7kzpsjxnsljby5spvzq836v-libxml2-2.9.4/lib:/gnu/store/fsqc2k7irsrijfz41hi982b93an2zcpw-libxpm-3.5.12/lib:/gnu/store/a1n7dhcdwmawax3sgv75dkbsv9yd27pr-libxslt-1.1.29/lib:/gnu/store/dgz1p150n6ffs54qq4rzyh9fx26lrsad-libx11-1.6.4/lib:/gnu/store/h28ngqp5h1cwzbgzvln20s6q7h7r98hk-oniguruma-5.9.6/lib:/gnu/store/h338g4l4isiy1qh873w9112hggmkvdwf-openldap-2.4.44/lib:/gnu/store/liib5wid6rx9rkss78spc7wcqzwb1g2k-openssl-1.0.2j/lib:/gnu/store/039b1nq0jn2dqykwx5hd1b85sr08fiyc-pcre-8.38/lib:/gnu/store/awmx27f02la7sc4s63jxsdczclsf63gj-postgresql-9.5.5/lib:/gnu/store/k0x973sjylvi746ib2xn4v1hjp855qq1-readline-7.0/lib:/gnu/store/ra2x0w2ib17na09hn5c5mn1jxc8xyqmf-sqlite-3.15.1/lib:/gnu/store/87rcay953pf4nwn3911yvlwqvhrrgq4h-tidy-20091223/lib:/gnu/store/a64w9dq219a8d9k4mfz76mnzph9wsvfj-zlib-1.2.8/lib:/gnu/store/9kmlcadkj7y1ag0lc2jl9dajlq3m90zr-perl-5.24.0/lib:/gnu/store/xnhabcs7zqbgqzjvfxfzha2fc66m5mrz-perl-xml-parser-2.44/lib:/gnu/store/zpkwh5b3b3hrlpckdpb0givgqg5rf8gn-gettext-minimal-0.19.8.1/lib:/gnu/store/pkv2qqgprp4zxcqfspwwx81qm9lng0da-fontconfig-2.12.1/lib:/gnu/store/vhfgzz0j9ry060qvcbvyhcrj3ikvm1vv-libgpg-error-1.24/lib:/gnu/store/gjvjkcpvpnk6nng4p11ms1gf8mdrzjr2-libxcb-1.11.1/lib:/gnu/store/jwb8gd9d71y5k691i251k5498pxib7pl-kbproto-1.0.7/lib:/gnu/store/xydfiifs9slq0wv6n8j6p26icn2ihn88-ncurses-6.0/lib:/gnu/store/ppk2n4xi6pzgchcfzl2p48yj7y4jvnjv-expat-2.2.0/lib:/gnu/store/sc8fxjbwfnzn7wyvdyqmkz6a068xnafl-libxdmcp-1.1.2/lib:/gnu/store/ac3q2lp5y4wf6jbxvnk46dn17gfp84yg-libxau-1.0.8/lib:/gnu/store/ydal55jilkdc6vv2s7s9kvv1knl56ff6-libpthread-stubs-0.3/lib:/gnu/store/jnkpy7blw1qsika8201bbf3zl640hy9k-xproto-7.0.29/lib:/gnu/store/1z9rjq9rzqzbjrvhba9fj0nxqa94rn7f-util-macros-1.19.0/lib $_SERVER['TERMINFO_DIRS'] => /gnu/store/xydfiifs9slq0wv6n8j6p26icn2ihn88-ncurses-6.0/share/terminfo $_SERVER['SSH_TTY'] => deleted $_SERVER['TEMPDIR'] => /tmp/guix-build-php-7.0.14.drv-0 $_SERVER['PERL5LIB'] => /gnu/store/9kmlcadkj7y1ag0lc2jl9dajlq3m90zr-perl-5.24.0/lib/perl5/site_perl:/gnu/store/xnhabcs7zqbgqzjvfxfzha2fc66m5mrz-perl-xml-parser-2.44/lib/perl5/site_perl $_SERVER['MAKELEVEL'] => 1 $_SERVER['SHLVL'] => 2 $_SERVER['NIX_BUILD_CORES'] => 1 $_SERVER['SOURCE_DATE_EPOCH'] => 1 $_SERVER['TEMP'] => /tmp/guix-build-php-7.0.14.drv-0 $_SERVER['BASH_LOADABLES_PATH'] => /gnu/store/qkw4zrwfybxww8f56nkb6hggxambk89b-bash-4.4.0/lib/bash $_SERVER['CPLUS_INCLUDE_PATH'] => /gnu/store/9cw2mj574gh8kmhjnv5rzyjj3dqvgqv5-procps-3.3.12/include:/gnu/store/d5nscny560slzpljixqzim6b8ms7hhv2-bzip2-1.0.6/include:/gnu/store/4yg6q1kp856m68arkpqc85hqgbffhpxf-xz-5.2.2/include:/gnu/store/06icf5h4z83mw5g17a58fy26z14dsj9z-file-5.28/include:/gnu/store/k03y1lfaj1xw0d7j2lxdil8ii5c67fdy-gawk-4.1.4/include:/gnu/store/c5ihjcdxsm9086323bn2j67v7z34lc1a-make-4.2.1/include:/gnu/store/4xxd00drj8gjcr84xdfna44qak2vhwmf-binutils-2.27/include:/gnu/store/y1g6991kxvdk4vxhsq07r5saww30v8dq-gcc-4.9.4/include:/gnu/store/iwgi9001dmmihrjg4rqhd6pa6788prjw-glibc-2.24/include:/gnu/store/683xx2qh0b7vwyfrdhs9rvsjfgjy07rz-aspell-0.60.6.1/include:/gnu/store/8mcfg4f9ncxjk5aqm0rc0yvvh9bpisdz-bzip2-1.0.6/include:/gnu/store/zl3rh35m8psblbw034l9bvssx5yqn7f5-curl-7.50.3/include:/gnu/store/xvsww5q2j9g4csi2i2mkpjm09mywnb6g-cyrus-sasl-2.1.26/include:/gnu/store/hmc1jiyr29mk9cl2d9j0jwf0dim1q76g-freetype-2.6.3/include:/gnu/store/ir4ldfw5paaf7xg34xckysl8xy9sjpmg-gd-2.2.3/include:/gnu/store/30q87g4yfk4vpy58j42g60xijgw1nfll-gdbm-1.12/include:/gnu/store/8dfvnp3x82f6dp4siph3z0zydy0y6p4v-glibc-2.24/include:/gnu/store/6k08nkddnrb15h5pwp1s0fa94mr1qas9-gmp-6.1.1/include:/gnu/store/4pnp5scrgmjp21flaihmgbckwrz6z4g3-libgcrypt-1.7.3/include:/gnu/store/0fv0ppzi9c4an7gy2kb07j0pi1jvfcaf-libjpeg-9b/include:/gnu/store/hin7b7nq2jizd93089zzmjh7i4781j8j-libpng-1.6.25/include:/gnu/store/rml0vaksi3ls1i0gp06p6h438701mrqz-libwebp-0.5.1/include:/gnu/store/cgr9z8n3i7kzpsjxnsljby5spvzq836v-libxml2-2.9.4/include:/gnu/store/fsqc2k7irsrijfz41hi982b93an2zcpw-libxpm-3.5.12/include:/gnu/store/a1n7dhcdwmawax3sgv75dkbsv9yd27pr-libxslt-1.1.29/include:/gnu/store/dgz1p150n6ffs54qq4rzyh9fx26lrsad-libx11-1.6.4/include:/gnu/store/h28ngqp5h1cwzbgzvln20s6q7h7r98hk-oniguruma-5.9.6/include:/gnu/store/h338g4l4isiy1qh873w9112hggmkvdwf-openldap-2.4.44/include:/gnu/store/liib5wid6rx9rkss78spc7wcqzwb1g2k-openssl-1.0.2j/include:/gnu/store/039b1nq0jn2dqykwx5hd1b85sr08fiyc-pcre-8.38/include:/gnu/store/awmx27f02la7sc4s63jxsdczclsf63gj-postgresql-9.5.5/include:/gnu/store/k0x973sjylvi746ib2xn4v1hjp855qq1-readline-7.0/include:/gnu/store/ra2x0w2ib17na09hn5c5mn1jxc8xyqmf-sqlite-3.15.1/include:/gnu/store/87rcay953pf4nwn3911yvlwqvhrrgq4h-tidy-20091223/include:/gnu/store/a64w9dq219a8d9k4mfz76mnzph9wsvfj-zlib-1.2.8/include:/gnu/store/zpkwh5b3b3hrlpckdpb0givgqg5rf8gn-gettext-minimal-0.19.8.1/include:/gnu/store/jc898psn5yc9s328nn8fya3sc2daf037-linux-libre-headers-4.4.18/include:/gnu/store/pkv2qqgprp4zxcqfspwwx81qm9lng0da-fontconfig-2.12.1/include:/gnu/store/5c2ipd35wb0z51sl7pm6za81g6h1v51b-linux-libre-headers-4.4.18/include:/gnu/store/vhfgzz0j9ry060qvcbvyhcrj3ikvm1vv-libgpg-error-1.24/include:/gnu/store/gjvjkcpvpnk6nng4p11ms1gf8mdrzjr2-libxcb-1.11.1/include:/gnu/store/jwb8gd9d71y5k691i251k5498pxib7pl-kbproto-1.0.7/include:/gnu/store/xydfiifs9slq0wv6n8j6p26icn2ihn88-ncurses-6.0/include:/gnu/store/ppk2n4xi6pzgchcfzl2p48yj7y4jvnjv-expat-2.2.0/include:/gnu/store/sc8fxjbwfnzn7wyvdyqmkz6a068xnafl-libxdmcp-1.1.2/include:/gnu/store/ac3q2lp5y4wf6jbxvnk46dn17gfp84yg-libxau-1.0.8/include:/gnu/store/jnkpy7blw1qsika8201bbf3zl640hy9k-xproto-7.0.29/include $_SERVER['PATH'] => /gnu/store/gss5fk5yh86m6qm7avvnq06nv99pb4jr-pkg-config-0.29/bin:/gnu/store/s4i0g2xg23dz0a0l5slk251vq5jzpavp-bison-3.0.4/bin:/gnu/store/l6y1bsy3dj7jc1p8z8g1m03k5nqn4a1c-intltool-0.51.0/bin:/gnu/store/9cw2mj574gh8kmhjnv5rzyjj3dqvgqv5-procps-3.3.12/bin:/gnu/store/9cw2mj574gh8kmhjnv5rzyjj3dqvgqv5-procps-3.3.12/sbin:/gnu/store/9l52vcmb1ambc3ypf7nxn38ac0976yyf-tar-1.29/bin:/gnu/store/ginbign0swn8h69k3z4fy18r8pwq3rqx-gzip-1.8/bin:/gnu/store/d5nscny560slzpljixqzim6b8ms7hhv2-bzip2-1.0.6/bin:/gnu/store/4yg6q1kp856m68arkpqc85hqgbffhpxf-xz-5.2.2/bin:/gnu/store/06icf5h4z83mw5g17a58fy26z14dsj9z-file-5.28/bin:/gnu/store/g0lyirlbqday5n2n0n6lh6nmdxi8a45z-diffutils-3.5/bin:/gnu/store/fs49m4pvdf2v7kixf9sls8nmhvh40ajl-patch-2.7.5/bin:/gnu/store/9761yfpvyr1fcpjhry8pgb3f0k6kj8n4-sed-4.2.2/bin:/gnu/store/cz7dl482c1j6j5s4vh1pll4lzdl5sl6b-findutils-4.6.0/bin:/gnu/store/k03y1lfaj1xw0d7j2lxdil8ii5c67fdy-gawk-4.1.4/bin:/gnu/store/hb301wl5s7352vbn1vds85dhy32n0hkw-grep-2.25/bin:/gnu/store/9xfn6q7cxqxaxsv6kgiic9iygl2iv2ci-coreutils-8.25/bin:/gnu/store/c5ihjcdxsm9086323bn2j67v7z34lc1a-make-4.2.1/bin:/gnu/store/qkw4zrwfybxww8f56nkb6hggxambk89b-bash-4.4.0/bin:/gnu/store/c7lm5innppxm53bf5w7i99d59kjdyx27-ld-wrapper-0/bin:/gnu/store/4xxd00drj8gjcr84xdfna44qak2vhwmf-binutils-2.27/bin:/gnu/store/y1g6991kxvdk4vxhsq07r5saww30v8dq-gcc-4.9.4/bin:/gnu/store/iwgi9001dmmihrjg4rqhd6pa6788prjw-glibc-2.24/bin:/gnu/store/iwgi9001dmmihrjg4rqhd6pa6788prjw-glibc-2.24/sbin:/gnu/store/683xx2qh0b7vwyfrdhs9rvsjfgjy07rz-aspell-0.60.6.1/bin:/gnu/store/8mcfg4f9ncxjk5aqm0rc0yvvh9bpisdz-bzip2-1.0.6/bin:/gnu/store/zl3rh35m8psblbw034l9bvssx5yqn7f5-curl-7.50.3/bin:/gnu/store/xvsww5q2j9g4csi2i2mkpjm09mywnb6g-cyrus-sasl-2.1.26/sbin:/gnu/store/hmc1jiyr29mk9cl2d9j0jwf0dim1q76g-freetype-2.6.3/bin:/gnu/store/ir4ldfw5paaf7xg34xckysl8xy9sjpmg-gd-2.2.3/bin:/gnu/store/30q87g4yfk4vpy58j42g60xijgw1nfll-gdbm-1.12/bin:/gnu/store/8dfvnp3x82f6dp4siph3z0zydy0y6p4v-glibc-2.24/bin:/gnu/store/8dfvnp3x82f6dp4siph3z0zydy0y6p4v-glibc-2.24/sbin:/gnu/store/4pnp5scrgmjp21flaihmgbckwrz6z4g3-libgcrypt-1.7.3/bin:/gnu/store/0fv0ppzi9c4an7gy2kb07j0pi1jvfcaf-libjpeg-9b/bin:/gnu/store/hin7b7nq2jizd93089zzmjh7i4781j8j-libpng-1.6.25/bin:/gnu/store/rml0vaksi3ls1i0gp06p6h438701mrqz-libwebp-0.5.1/bin:/gnu/store/cgr9z8n3i7kzpsjxnsljby5spvzq836v-libxml2-2.9.4/bin:/gnu/store/fsqc2k7irsrijfz41hi982b93an2zcpw-libxpm-3.5.12/bin:/gnu/store/a1n7dhcdwmawax3sgv75dkbsv9yd27pr-libxslt-1.1.29/bin:/gnu/store/h28ngqp5h1cwzbgzvln20s6q7h7r98hk-oniguruma-5.9.6/bin:/gnu/store/h338g4l4isiy1qh873w9112hggmkvdwf-openldap-2.4.44/bin:/gnu/store/h338g4l4isiy1qh873w9112hggmkvdwf-openldap-2.4.44/sbin:/gnu/store/liib5wid6rx9rkss78spc7wcqzwb1g2k-openssl-1.0.2j/bin:/gnu/store/awmx27f02la7sc4s63jxsdczclsf63gj-postgresql-9.5.5/bin:/gnu/store/k0x973sjylvi746ib2xn4v1hjp855qq1-readline-7.0/bin:/gnu/store/ra2x0w2ib17na09hn5c5mn1jxc8xyqmf-sqlite-3.15.1/bin:/gnu/store/87rcay953pf4nwn3911yvlwqvhrrgq4h-tidy-20091223/bin:/gnu/store/c7svspffz4v5fcbkx53jzvw08b2n6plf-zip-3.0/bin:/gnu/store/pawyi1z8xabzg49cqymhply84701krq1-m4-1.4.17/bin:/gnu/store/9kmlcadkj7y1ag0lc2jl9dajlq3m90zr-perl-5.24.0/bin:/gnu/store/zpkwh5b3b3hrlpckdpb0givgqg5rf8gn-gettext-minimal-0.19.8.1/bin:/gnu/store/pkv2qqgprp4zxcqfspwwx81qm9lng0da-fontconfig-2.12.1/bin:/gnu/store/vhfgzz0j9ry060qvcbvyhcrj3ikvm1vv-libgpg-error-1.24/bin:/gnu/store/xydfiifs9slq0wv6n8j6p26icn2ihn88-ncurses-6.0/bin:/gnu/store/ppk2n4xi6pzgchcfzl2p48yj7y4jvnjv-expat-2.2.0/bin $_SERVER['NIX_BUILD_TOP'] => /tmp/guix-build-php-7.0.14.drv-0 $_SERVER['PKG_CONFIG_PATH'] => /gnu/store/9cw2mj574gh8kmhjnv5rzyjj3dqvgqv5-procps-3.3.12/lib/pkgconfig:/gnu/store/4yg6q1kp856m68arkpqc85hqgbffhpxf-xz-5.2.2/lib/pkgconfig:/gnu/store/zl3rh35m8psblbw034l9bvssx5yqn7f5-curl-7.50.3/lib/pkgconfig:/gnu/store/xvsww5q2j9g4csi2i2mkpjm09mywnb6g-cyrus-sasl-2.1.26/lib/pkgconfig:/gnu/store/hmc1jiyr29mk9cl2d9j0jwf0dim1q76g-freetype-2.6.3/lib/pkgconfig:/gnu/store/ir4ldfw5paaf7xg34xckysl8xy9sjpmg-gd-2.2.3/lib/pkgconfig:/gnu/store/hin7b7nq2jizd93089zzmjh7i4781j8j-libpng-1.6.25/lib/pkgconfig:/gnu/store/rml0vaksi3ls1i0gp06p6h438701mrqz-libwebp-0.5.1/lib/pkgconfig:/gnu/store/cgr9z8n3i7kzpsjxnsljby5spvzq836v-libxml2-2.9.4/lib/pkgconfig:/gnu/store/fsqc2k7irsrijfz41hi982b93an2zcpw-libxpm-3.5.12/lib/pkgconfig:/gnu/store/a1n7dhcdwmawax3sgv75dkbsv9yd27pr-libxslt-1.1.29/lib/pkgconfig:/gnu/store/dgz1p150n6ffs54qq4rzyh9fx26lrsad-libx11-1.6.4/lib/pkgconfig:/gnu/store/h28ngqp5h1cwzbgzvln20s6q7h7r98hk-oniguruma-5.9.6/lib/pkgconfig:/gnu/store/liib5wid6rx9rkss78spc7wcqzwb1g2k-openssl-1.0.2j/lib/pkgconfig:/gnu/store/039b1nq0jn2dqykwx5hd1b85sr08fiyc-pcre-8.38/lib/pkgconfig:/gnu/store/awmx27f02la7sc4s63jxsdczclsf63gj-postgresql-9.5.5/lib/pkgconfig:/gnu/store/ra2x0w2ib17na09hn5c5mn1jxc8xyqmf-sqlite-3.15.1/lib/pkgconfig:/gnu/store/a64w9dq219a8d9k4mfz76mnzph9wsvfj-zlib-1.2.8/lib/pkgconfig:/gnu/store/pkv2qqgprp4zxcqfspwwx81qm9lng0da-fontconfig-2.12.1/lib/pkgconfig:/gnu/store/gjvjkcpvpnk6nng4p11ms1gf8mdrzjr2-libxcb-1.11.1/lib/pkgconfig:/gnu/store/jwb8gd9d71y5k691i251k5498pxib7pl-kbproto-1.0.7/lib/pkgconfig:/gnu/store/ppk2n4xi6pzgchcfzl2p48yj7y4jvnjv-expat-2.2.0/lib/pkgconfig:/gnu/store/sc8fxjbwfnzn7wyvdyqmkz6a068xnafl-libxdmcp-1.1.2/lib/pkgconfig:/gnu/store/ac3q2lp5y4wf6jbxvnk46dn17gfp84yg-libxau-1.0.8/lib/pkgconfig:/gnu/store/ydal55jilkdc6vv2s7s9kvv1knl56ff6-libpthread-stubs-0.3/lib/pkgconfig:/gnu/store/jnkpy7blw1qsika8201bbf3zl640hy9k-xproto-7.0.29/lib/pkgconfig:/gnu/store/1z9rjq9rzqzbjrvhba9fj0nxqa94rn7f-util-macros-1.19.0/lib/pkgconfig $_SERVER['MAKEFLAGS'] => -j1 $_SERVER['TEST_PHP_EXECUTABLE'] => /tmp/guix-build-php-7.0.14.drv-0/php-7.0.14/sapi/cli/php $_SERVER['PHP_SELF'] => $_SERVER['SCRIPT_NAME'] => $_SERVER['SCRIPT_FILENAME'] => $_SERVER['PATH_TRANSLATED'] => $_SERVER['DOCUMENT_ROOT'] => $_SERVER['REQUEST_TIME_FLOAT'] => 1485584989.399 $_SERVER['REQUEST_TIME'] => 1485584989 $_SERVER['argv'] => Array ( ) $_SERVER['argc'] => 0 $_ENV['LC_ALL'] => en_US.utf8 $_ENV['SSH_CONNECTION'] => deleted $_ENV['TEST_PHP_SRCDIR'] => /tmp/guix-build-php-7.0.14.drv-0/php-7.0.14 $_ENV['_'] => /tmp/guix-build-php-7.0.14.drv-0/php-7.0.14/sapi/cli/php $_ENV['C_INCLUDE_PATH'] => /gnu/store/9cw2mj574gh8kmhjnv5rzyjj3dqvgqv5-procps-3.3.12/include:/gnu/store/d5nscny560slzpljixqzim6b8ms7hhv2-bzip2-1.0.6/include:/gnu/store/4yg6q1kp856m68arkpqc85hqgbffhpxf-xz-5.2.2/include:/gnu/store/06icf5h4z83mw5g17a58fy26z14dsj9z-file-5.28/include:/gnu/store/k03y1lfaj1xw0d7j2lxdil8ii5c67fdy-gawk-4.1.4/include:/gnu/store/c5ihjcdxsm9086323bn2j67v7z34lc1a-make-4.2.1/include:/gnu/store/4xxd00drj8gjcr84xdfna44qak2vhwmf-binutils-2.27/include:/gnu/store/y1g6991kxvdk4vxhsq07r5saww30v8dq-gcc-4.9.4/include:/gnu/store/iwgi9001dmmihrjg4rqhd6pa6788prjw-glibc-2.24/include:/gnu/store/683xx2qh0b7vwyfrdhs9rvsjfgjy07rz-aspell-0.60.6.1/include:/gnu/store/8mcfg4f9ncxjk5aqm0rc0yvvh9bpisdz-bzip2-1.0.6/include:/gnu/store/zl3rh35m8psblbw034l9bvssx5yqn7f5-curl-7.50.3/include:/gnu/store/xvsww5q2j9g4csi2i2mkpjm09mywnb6g-cyrus-sasl-2.1.26/include:/gnu/store/hmc1jiyr29mk9cl2d9j0jwf0dim1q76g-freetype-2.6.3/include:/gnu/store/ir4ldfw5paaf7xg34xckysl8xy9sjpmg-gd-2.2.3/include:/gnu/store/30q87g4yfk4vpy58j42g60xijgw1nfll-gdbm-1.12/include:/gnu/store/8dfvnp3x82f6dp4siph3z0zydy0y6p4v-glibc-2.24/include:/gnu/store/6k08nkddnrb15h5pwp1s0fa94mr1qas9-gmp-6.1.1/include:/gnu/store/4pnp5scrgmjp21flaihmgbckwrz6z4g3-libgcrypt-1.7.3/include:/gnu/store/0fv0ppzi9c4an7gy2kb07j0pi1jvfcaf-libjpeg-9b/include:/gnu/store/hin7b7nq2jizd93089zzmjh7i4781j8j-libpng-1.6.25/include:/gnu/store/rml0vaksi3ls1i0gp06p6h438701mrqz-libwebp-0.5.1/include:/gnu/store/cgr9z8n3i7kzpsjxnsljby5spvzq836v-libxml2-2.9.4/include:/gnu/store/fsqc2k7irsrijfz41hi982b93an2zcpw-libxpm-3.5.12/include:/gnu/store/a1n7dhcdwmawax3sgv75dkbsv9yd27pr-libxslt-1.1.29/include:/gnu/store/dgz1p150n6ffs54qq4rzyh9fx26lrsad-libx11-1.6.4/include:/gnu/store/h28ngqp5h1cwzbgzvln20s6q7h7r98hk-oniguruma-5.9.6/include:/gnu/store/h338g4l4isiy1qh873w9112hggmkvdwf-openldap-2.4.44/include:/gnu/store/liib5wid6rx9rkss78spc7wcqzwb1g2k-openssl-1.0.2j/include:/gnu/store/039b1nq0jn2dqykwx5hd1b85sr08fiyc-pcre-8.38/include:/gnu/store/awmx27f02la7sc4s63jxsdczclsf63gj-postgresql-9.5.5/include:/gnu/store/k0x973sjylvi746ib2xn4v1hjp855qq1-readline-7.0/include:/gnu/store/ra2x0w2ib17na09hn5c5mn1jxc8xyqmf-sqlite-3.15.1/include:/gnu/store/87rcay953pf4nwn3911yvlwqvhrrgq4h-tidy-20091223/include:/gnu/store/a64w9dq219a8d9k4mfz76mnzph9wsvfj-zlib-1.2.8/include:/gnu/store/zpkwh5b3b3hrlpckdpb0givgqg5rf8gn-gettext-minimal-0.19.8.1/include:/gnu/store/jc898psn5yc9s328nn8fya3sc2daf037-linux-libre-headers-4.4.18/include:/gnu/store/pkv2qqgprp4zxcqfspwwx81qm9lng0da-fontconfig-2.12.1/include:/gnu/store/5c2ipd35wb0z51sl7pm6za81g6h1v51b-linux-libre-headers-4.4.18/include:/gnu/store/vhfgzz0j9ry060qvcbvyhcrj3ikvm1vv-libgpg-error-1.24/include:/gnu/store/gjvjkcpvpnk6nng4p11ms1gf8mdrzjr2-libxcb-1.11.1/include:/gnu/store/jwb8gd9d71y5k691i251k5498pxib7pl-kbproto-1.0.7/include:/gnu/store/xydfiifs9slq0wv6n8j6p26icn2ihn88-ncurses-6.0/include:/gnu/store/ppk2n4xi6pzgchcfzl2p48yj7y4jvnjv-expat-2.2.0/include:/gnu/store/sc8fxjbwfnzn7wyvdyqmkz6a068xnafl-libxdmcp-1.1.2/include:/gnu/store/ac3q2lp5y4wf6jbxvnk46dn17gfp84yg-libxau-1.0.8/include:/gnu/store/jnkpy7blw1qsika8201bbf3zl640hy9k-xproto-7.0.29/include $_ENV['out'] => /gnu/store/bln302msasii0db9yx7lfq1yv3c51nlz-php-7.0.14 $_ENV['SKIP_ONLINE_TESTS'] => 1 $_ENV['REPORT_EXIT_STATUS'] => 1 $_ENV['SSH_AUTH_SOCK'] => deleted $_ENV['MFLAGS'] => -j1 $_ENV['CC'] => gcc $_ENV['GUIX_LOCPATH'] => /gnu/store/py9ff8syssr3d8a5nlkdp8kdglj20p1n-glibc-utf8-locales-2.24/lib/locale $_ENV['PWD'] => /tmp/guix-build-php-7.0.14.drv-0/php-7.0.14 $_ENV['HOME'] => /homeless-shelter $_ENV['TMP'] => /tmp/guix-build-php-7.0.14.drv-0 $_ENV['SSH_CLIENT'] => deleted $_ENV['NIX_STORE'] => /gnu/store $_ENV['TMPDIR'] => /tmp/guix-build-php-7.0.14.drv-0 $_ENV['LIBRARY_PATH'] => /gnu/store/s4i0g2xg23dz0a0l5slk251vq5jzpavp-bison-3.0.4/lib:/gnu/store/9cw2mj574gh8kmhjnv5rzyjj3dqvgqv5-procps-3.3.12/lib:/gnu/store/d5nscny560slzpljixqzim6b8ms7hhv2-bzip2-1.0.6/lib:/gnu/store/4yg6q1kp856m68arkpqc85hqgbffhpxf-xz-5.2.2/lib:/gnu/store/06icf5h4z83mw5g17a58fy26z14dsj9z-file-5.28/lib:/gnu/store/k03y1lfaj1xw0d7j2lxdil8ii5c67fdy-gawk-4.1.4/lib:/gnu/store/qkw4zrwfybxww8f56nkb6hggxambk89b-bash-4.4.0/lib:/gnu/store/4xxd00drj8gjcr84xdfna44qak2vhwmf-binutils-2.27/lib:/gnu/store/iwgi9001dmmihrjg4rqhd6pa6788prjw-glibc-2.24/lib:/gnu/store/py9ff8syssr3d8a5nlkdp8kdglj20p1n-glibc-utf8-locales-2.24/lib:/gnu/store/683xx2qh0b7vwyfrdhs9rvsjfgjy07rz-aspell-0.60.6.1/lib:/gnu/store/8mcfg4f9ncxjk5aqm0rc0yvvh9bpisdz-bzip2-1.0.6/lib:/gnu/store/zl3rh35m8psblbw034l9bvssx5yqn7f5-curl-7.50.3/lib:/gnu/store/xvsww5q2j9g4csi2i2mkpjm09mywnb6g-cyrus-sasl-2.1.26/lib:/gnu/store/hmc1jiyr29mk9cl2d9j0jwf0dim1q76g-freetype-2.6.3/lib:/gnu/store/ir4ldfw5paaf7xg34xckysl8xy9sjpmg-gd-2.2.3/lib:/gnu/store/30q87g4yfk4vpy58j42g60xijgw1nfll-gdbm-1.12/lib:/gnu/store/8dfvnp3x82f6dp4siph3z0zydy0y6p4v-glibc-2.24/lib:/gnu/store/6k08nkddnrb15h5pwp1s0fa94mr1qas9-gmp-6.1.1/lib:/gnu/store/4pnp5scrgmjp21flaihmgbckwrz6z4g3-libgcrypt-1.7.3/lib:/gnu/store/0fv0ppzi9c4an7gy2kb07j0pi1jvfcaf-libjpeg-9b/lib:/gnu/store/hin7b7nq2jizd93089zzmjh7i4781j8j-libpng-1.6.25/lib:/gnu/store/rml0vaksi3ls1i0gp06p6h438701mrqz-libwebp-0.5.1/lib:/gnu/store/cgr9z8n3i7kzpsjxnsljby5spvzq836v-libxml2-2.9.4/lib:/gnu/store/fsqc2k7irsrijfz41hi982b93an2zcpw-libxpm-3.5.12/lib:/gnu/store/a1n7dhcdwmawax3sgv75dkbsv9yd27pr-libxslt-1.1.29/lib:/gnu/store/dgz1p150n6ffs54qq4rzyh9fx26lrsad-libx11-1.6.4/lib:/gnu/store/h28ngqp5h1cwzbgzvln20s6q7h7r98hk-oniguruma-5.9.6/lib:/gnu/store/h338g4l4isiy1qh873w9112hggmkvdwf-openldap-2.4.44/lib:/gnu/store/liib5wid6rx9rkss78spc7wcqzwb1g2k-openssl-1.0.2j/lib:/gnu/store/039b1nq0jn2dqykwx5hd1b85sr08fiyc-pcre-8.38/lib:/gnu/store/awmx27f02la7sc4s63jxsdczclsf63gj-postgresql-9.5.5/lib:/gnu/store/k0x973sjylvi746ib2xn4v1hjp855qq1-readline-7.0/lib:/gnu/store/ra2x0w2ib17na09hn5c5mn1jxc8xyqmf-sqlite-3.15.1/lib:/gnu/store/87rcay953pf4nwn3911yvlwqvhrrgq4h-tidy-20091223/lib:/gnu/store/a64w9dq219a8d9k4mfz76mnzph9wsvfj-zlib-1.2.8/lib:/gnu/store/9kmlcadkj7y1ag0lc2jl9dajlq3m90zr-perl-5.24.0/lib:/gnu/store/xnhabcs7zqbgqzjvfxfzha2fc66m5mrz-perl-xml-parser-2.44/lib:/gnu/store/zpkwh5b3b3hrlpckdpb0givgqg5rf8gn-gettext-minimal-0.19.8.1/lib:/gnu/store/pkv2qqgprp4zxcqfspwwx81qm9lng0da-fontconfig-2.12.1/lib:/gnu/store/vhfgzz0j9ry060qvcbvyhcrj3ikvm1vv-libgpg-error-1.24/lib:/gnu/store/gjvjkcpvpnk6nng4p11ms1gf8mdrzjr2-libxcb-1.11.1/lib:/gnu/store/jwb8gd9d71y5k691i251k5498pxib7pl-kbproto-1.0.7/lib:/gnu/store/xydfiifs9slq0wv6n8j6p26icn2ihn88-ncurses-6.0/lib:/gnu/store/ppk2n4xi6pzgchcfzl2p48yj7y4jvnjv-expat-2.2.0/lib:/gnu/store/sc8fxjbwfnzn7wyvdyqmkz6a068xnafl-libxdmcp-1.1.2/lib:/gnu/store/ac3q2lp5y4wf6jbxvnk46dn17gfp84yg-libxau-1.0.8/lib:/gnu/store/ydal55jilkdc6vv2s7s9kvv1knl56ff6-libpthread-stubs-0.3/lib:/gnu/store/jnkpy7blw1qsika8201bbf3zl640hy9k-xproto-7.0.29/lib:/gnu/store/1z9rjq9rzqzbjrvhba9fj0nxqa94rn7f-util-macros-1.19.0/lib $_ENV['TERMINFO_DIRS'] => /gnu/store/xydfiifs9slq0wv6n8j6p26icn2ihn88-ncurses-6.0/share/terminfo $_ENV['SSH_TTY'] => deleted $_ENV['TEMPDIR'] => /tmp/guix-build-php-7.0.14.drv-0 $_ENV['PERL5LIB'] => /gnu/store/9kmlcadkj7y1ag0lc2jl9dajlq3m90zr-perl-5.24.0/lib/perl5/site_perl:/gnu/store/xnhabcs7zqbgqzjvfxfzha2fc66m5mrz-perl-xml-parser-2.44/lib/perl5/site_perl $_ENV['MAKELEVEL'] => 1 $_ENV['SHLVL'] => 2 $_ENV['NIX_BUILD_CORES'] => 1 $_ENV['SOURCE_DATE_EPOCH'] => 1 $_ENV['TEMP'] => /tmp/guix-build-php-7.0.14.drv-0 $_ENV['BASH_LOADABLES_PATH'] => /gnu/store/qkw4zrwfybxww8f56nkb6hggxambk89b-bash-4.4.0/lib/bash $_ENV['CPLUS_INCLUDE_PATH'] => /gnu/store/9cw2mj574gh8kmhjnv5rzyjj3dqvgqv5-procps-3.3.12/include:/gnu/store/d5nscny560slzpljixqzim6b8ms7hhv2-bzip2-1.0.6/include:/gnu/store/4yg6q1kp856m68arkpqc85hqgbffhpxf-xz-5.2.2/include:/gnu/store/06icf5h4z83mw5g17a58fy26z14dsj9z-file-5.28/include:/gnu/store/k03y1lfaj1xw0d7j2lxdil8ii5c67fdy-gawk-4.1.4/include:/gnu/store/c5ihjcdxsm9086323bn2j67v7z34lc1a-make-4.2.1/include:/gnu/store/4xxd00drj8gjcr84xdfna44qak2vhwmf-binutils-2.27/include:/gnu/store/y1g6991kxvdk4vxhsq07r5saww30v8dq-gcc-4.9.4/include:/gnu/store/iwgi9001dmmihrjg4rqhd6pa6788prjw-glibc-2.24/include:/gnu/store/683xx2qh0b7vwyfrdhs9rvsjfgjy07rz-aspell-0.60.6.1/include:/gnu/store/8mcfg4f9ncxjk5aqm0rc0yvvh9bpisdz-bzip2-1.0.6/include:/gnu/store/zl3rh35m8psblbw034l9bvssx5yqn7f5-curl-7.50.3/include:/gnu/store/xvsww5q2j9g4csi2i2mkpjm09mywnb6g-cyrus-sasl-2.1.26/include:/gnu/store/hmc1jiyr29mk9cl2d9j0jwf0dim1q76g-freetype-2.6.3/include:/gnu/store/ir4ldfw5paaf7xg34xckysl8xy9sjpmg-gd-2.2.3/include:/gnu/store/30q87g4yfk4vpy58j42g60xijgw1nfll-gdbm-1.12/include:/gnu/store/8dfvnp3x82f6dp4siph3z0zydy0y6p4v-glibc-2.24/include:/gnu/store/6k08nkddnrb15h5pwp1s0fa94mr1qas9-gmp-6.1.1/include:/gnu/store/4pnp5scrgmjp21flaihmgbckwrz6z4g3-libgcrypt-1.7.3/include:/gnu/store/0fv0ppzi9c4an7gy2kb07j0pi1jvfcaf-libjpeg-9b/include:/gnu/store/hin7b7nq2jizd93089zzmjh7i4781j8j-libpng-1.6.25/include:/gnu/store/rml0vaksi3ls1i0gp06p6h438701mrqz-libwebp-0.5.1/include:/gnu/store/cgr9z8n3i7kzpsjxnsljby5spvzq836v-libxml2-2.9.4/include:/gnu/store/fsqc2k7irsrijfz41hi982b93an2zcpw-libxpm-3.5.12/include:/gnu/store/a1n7dhcdwmawax3sgv75dkbsv9yd27pr-libxslt-1.1.29/include:/gnu/store/dgz1p150n6ffs54qq4rzyh9fx26lrsad-libx11-1.6.4/include:/gnu/store/h28ngqp5h1cwzbgzvln20s6q7h7r98hk-oniguruma-5.9.6/include:/gnu/store/h338g4l4isiy1qh873w9112hggmkvdwf-openldap-2.4.44/include:/gnu/store/liib5wid6rx9rkss78spc7wcqzwb1g2k-openssl-1.0.2j/include:/gnu/store/039b1nq0jn2dqykwx5hd1b85sr08fiyc-pcre-8.38/include:/gnu/store/awmx27f02la7sc4s63jxsdczclsf63gj-postgresql-9.5.5/include:/gnu/store/k0x973sjylvi746ib2xn4v1hjp855qq1-readline-7.0/include:/gnu/store/ra2x0w2ib17na09hn5c5mn1jxc8xyqmf-sqlite-3.15.1/include:/gnu/store/87rcay953pf4nwn3911yvlwqvhrrgq4h-tidy-20091223/include:/gnu/store/a64w9dq219a8d9k4mfz76mnzph9wsvfj-zlib-1.2.8/include:/gnu/store/zpkwh5b3b3hrlpckdpb0givgqg5rf8gn-gettext-minimal-0.19.8.1/include:/gnu/store/jc898psn5yc9s328nn8fya3sc2daf037-linux-libre-headers-4.4.18/include:/gnu/store/pkv2qqgprp4zxcqfspwwx81qm9lng0da-fontconfig-2.12.1/include:/gnu/store/5c2ipd35wb0z51sl7pm6za81g6h1v51b-linux-libre-headers-4.4.18/include:/gnu/store/vhfgzz0j9ry060qvcbvyhcrj3ikvm1vv-libgpg-error-1.24/include:/gnu/store/gjvjkcpvpnk6nng4p11ms1gf8mdrzjr2-libxcb-1.11.1/include:/gnu/store/jwb8gd9d71y5k691i251k5498pxib7pl-kbproto-1.0.7/include:/gnu/store/xydfiifs9slq0wv6n8j6p26icn2ihn88-ncurses-6.0/include:/gnu/store/ppk2n4xi6pzgchcfzl2p48yj7y4jvnjv-expat-2.2.0/include:/gnu/store/sc8fxjbwfnzn7wyvdyqmkz6a068xnafl-libxdmcp-1.1.2/include:/gnu/store/ac3q2lp5y4wf6jbxvnk46dn17gfp84yg-libxau-1.0.8/include:/gnu/store/jnkpy7blw1qsika8201bbf3zl640hy9k-xproto-7.0.29/include $_ENV['PATH'] => /gnu/store/gss5fk5yh86m6qm7avvnq06nv99pb4jr-pkg-config-0.29/bin:/gnu/store/s4i0g2xg23dz0a0l5slk251vq5jzpavp-bison-3.0.4/bin:/gnu/store/l6y1bsy3dj7jc1p8z8g1m03k5nqn4a1c-intltool-0.51.0/bin:/gnu/store/9cw2mj574gh8kmhjnv5rzyjj3dqvgqv5-procps-3.3.12/bin:/gnu/store/9cw2mj574gh8kmhjnv5rzyjj3dqvgqv5-procps-3.3.12/sbin:/gnu/store/9l52vcmb1ambc3ypf7nxn38ac0976yyf-tar-1.29/bin:/gnu/store/ginbign0swn8h69k3z4fy18r8pwq3rqx-gzip-1.8/bin:/gnu/store/d5nscny560slzpljixqzim6b8ms7hhv2-bzip2-1.0.6/bin:/gnu/store/4yg6q1kp856m68arkpqc85hqgbffhpxf-xz-5.2.2/bin:/gnu/store/06icf5h4z83mw5g17a58fy26z14dsj9z-file-5.28/bin:/gnu/store/g0lyirlbqday5n2n0n6lh6nmdxi8a45z-diffutils-3.5/bin:/gnu/store/fs49m4pvdf2v7kixf9sls8nmhvh40ajl-patch-2.7.5/bin:/gnu/store/9761yfpvyr1fcpjhry8pgb3f0k6kj8n4-sed-4.2.2/bin:/gnu/store/cz7dl482c1j6j5s4vh1pll4lzdl5sl6b-findutils-4.6.0/bin:/gnu/store/k03y1lfaj1xw0d7j2lxdil8ii5c67fdy-gawk-4.1.4/bin:/gnu/store/hb301wl5s7352vbn1vds85dhy32n0hkw-grep-2.25/bin:/gnu/store/9xfn6q7cxqxaxsv6kgiic9iygl2iv2ci-coreutils-8.25/bin:/gnu/store/c5ihjcdxsm9086323bn2j67v7z34lc1a-make-4.2.1/bin:/gnu/store/qkw4zrwfybxww8f56nkb6hggxambk89b-bash-4.4.0/bin:/gnu/store/c7lm5innppxm53bf5w7i99d59kjdyx27-ld-wrapper-0/bin:/gnu/store/4xxd00drj8gjcr84xdfna44qak2vhwmf-binutils-2.27/bin:/gnu/store/y1g6991kxvdk4vxhsq07r5saww30v8dq-gcc-4.9.4/bin:/gnu/store/iwgi9001dmmihrjg4rqhd6pa6788prjw-glibc-2.24/bin:/gnu/store/iwgi9001dmmihrjg4rqhd6pa6788prjw-glibc-2.24/sbin:/gnu/store/683xx2qh0b7vwyfrdhs9rvsjfgjy07rz-aspell-0.60.6.1/bin:/gnu/store/8mcfg4f9ncxjk5aqm0rc0yvvh9bpisdz-bzip2-1.0.6/bin:/gnu/store/zl3rh35m8psblbw034l9bvssx5yqn7f5-curl-7.50.3/bin:/gnu/store/xvsww5q2j9g4csi2i2mkpjm09mywnb6g-cyrus-sasl-2.1.26/sbin:/gnu/store/hmc1jiyr29mk9cl2d9j0jwf0dim1q76g-freetype-2.6.3/bin:/gnu/store/ir4ldfw5paaf7xg34xckysl8xy9sjpmg-gd-2.2.3/bin:/gnu/store/30q87g4yfk4vpy58j42g60xijgw1nfll-gdbm-1.12/bin:/gnu/store/8dfvnp3x82f6dp4siph3z0zydy0y6p4v-glibc-2.24/bin:/gnu/store/8dfvnp3x82f6dp4siph3z0zydy0y6p4v-glibc-2.24/sbin:/gnu/store/4pnp5scrgmjp21flaihmgbckwrz6z4g3-libgcrypt-1.7.3/bin:/gnu/store/0fv0ppzi9c4an7gy2kb07j0pi1jvfcaf-libjpeg-9b/bin:/gnu/store/hin7b7nq2jizd93089zzmjh7i4781j8j-libpng-1.6.25/bin:/gnu/store/rml0vaksi3ls1i0gp06p6h438701mrqz-libwebp-0.5.1/bin:/gnu/store/cgr9z8n3i7kzpsjxnsljby5spvzq836v-libxml2-2.9.4/bin:/gnu/store/fsqc2k7irsrijfz41hi982b93an2zcpw-libxpm-3.5.12/bin:/gnu/store/a1n7dhcdwmawax3sgv75dkbsv9yd27pr-libxslt-1.1.29/bin:/gnu/store/h28ngqp5h1cwzbgzvln20s6q7h7r98hk-oniguruma-5.9.6/bin:/gnu/store/h338g4l4isiy1qh873w9112hggmkvdwf-openldap-2.4.44/bin:/gnu/store/h338g4l4isiy1qh873w9112hggmkvdwf-openldap-2.4.44/sbin:/gnu/store/liib5wid6rx9rkss78spc7wcqzwb1g2k-openssl-1.0.2j/bin:/gnu/store/awmx27f02la7sc4s63jxsdczclsf63gj-postgresql-9.5.5/bin:/gnu/store/k0x973sjylvi746ib2xn4v1hjp855qq1-readline-7.0/bin:/gnu/store/ra2x0w2ib17na09hn5c5mn1jxc8xyqmf-sqlite-3.15.1/bin:/gnu/store/87rcay953pf4nwn3911yvlwqvhrrgq4h-tidy-20091223/bin:/gnu/store/c7svspffz4v5fcbkx53jzvw08b2n6plf-zip-3.0/bin:/gnu/store/pawyi1z8xabzg49cqymhply84701krq1-m4-1.4.17/bin:/gnu/store/9kmlcadkj7y1ag0lc2jl9dajlq3m90zr-perl-5.24.0/bin:/gnu/store/zpkwh5b3b3hrlpckdpb0givgqg5rf8gn-gettext-minimal-0.19.8.1/bin:/gnu/store/pkv2qqgprp4zxcqfspwwx81qm9lng0da-fontconfig-2.12.1/bin:/gnu/store/vhfgzz0j9ry060qvcbvyhcrj3ikvm1vv-libgpg-error-1.24/bin:/gnu/store/xydfiifs9slq0wv6n8j6p26icn2ihn88-ncurses-6.0/bin:/gnu/store/ppk2n4xi6pzgchcfzl2p48yj7y4jvnjv-expat-2.2.0/bin $_ENV['NIX_BUILD_TOP'] => /tmp/guix-build-php-7.0.14.drv-0 $_ENV['PKG_CONFIG_PATH'] => /gnu/store/9cw2mj574gh8kmhjnv5rzyjj3dqvgqv5-procps-3.3.12/lib/pkgconfig:/gnu/store/4yg6q1kp856m68arkpqc85hqgbffhpxf-xz-5.2.2/lib/pkgconfig:/gnu/store/zl3rh35m8psblbw034l9bvssx5yqn7f5-curl-7.50.3/lib/pkgconfig:/gnu/store/xvsww5q2j9g4csi2i2mkpjm09mywnb6g-cyrus-sasl-2.1.26/lib/pkgconfig:/gnu/store/hmc1jiyr29mk9cl2d9j0jwf0dim1q76g-freetype-2.6.3/lib/pkgconfig:/gnu/store/ir4ldfw5paaf7xg34xckysl8xy9sjpmg-gd-2.2.3/lib/pkgconfig:/gnu/store/hin7b7nq2jizd93089zzmjh7i4781j8j-libpng-1.6.25/lib/pkgconfig:/gnu/store/rml0vaksi3ls1i0gp06p6h438701mrqz-libwebp-0.5.1/lib/pkgconfig:/gnu/store/cgr9z8n3i7kzpsjxnsljby5spvzq836v-libxml2-2.9.4/lib/pkgconfig:/gnu/store/fsqc2k7irsrijfz41hi982b93an2zcpw-libxpm-3.5.12/lib/pkgconfig:/gnu/store/a1n7dhcdwmawax3sgv75dkbsv9yd27pr-libxslt-1.1.29/lib/pkgconfig:/gnu/store/dgz1p150n6ffs54qq4rzyh9fx26lrsad-libx11-1.6.4/lib/pkgconfig:/gnu/store/h28ngqp5h1cwzbgzvln20s6q7h7r98hk-oniguruma-5.9.6/lib/pkgconfig:/gnu/store/liib5wid6rx9rkss78spc7wcqzwb1g2k-openssl-1.0.2j/lib/pkgconfig:/gnu/store/039b1nq0jn2dqykwx5hd1b85sr08fiyc-pcre-8.38/lib/pkgconfig:/gnu/store/awmx27f02la7sc4s63jxsdczclsf63gj-postgresql-9.5.5/lib/pkgconfig:/gnu/store/ra2x0w2ib17na09hn5c5mn1jxc8xyqmf-sqlite-3.15.1/lib/pkgconfig:/gnu/store/a64w9dq219a8d9k4mfz76mnzph9wsvfj-zlib-1.2.8/lib/pkgconfig:/gnu/store/pkv2qqgprp4zxcqfspwwx81qm9lng0da-fontconfig-2.12.1/lib/pkgconfig:/gnu/store/gjvjkcpvpnk6nng4p11ms1gf8mdrzjr2-libxcb-1.11.1/lib/pkgconfig:/gnu/store/jwb8gd9d71y5k691i251k5498pxib7pl-kbproto-1.0.7/lib/pkgconfig:/gnu/store/ppk2n4xi6pzgchcfzl2p48yj7y4jvnjv-expat-2.2.0/lib/pkgconfig:/gnu/store/sc8fxjbwfnzn7wyvdyqmkz6a068xnafl-libxdmcp-1.1.2/lib/pkgconfig:/gnu/store/ac3q2lp5y4wf6jbxvnk46dn17gfp84yg-libxau-1.0.8/lib/pkgconfig:/gnu/store/ydal55jilkdc6vv2s7s9kvv1knl56ff6-libpthread-stubs-0.3/lib/pkgconfig:/gnu/store/jnkpy7blw1qsika8201bbf3zl640hy9k-xproto-7.0.29/lib/pkgconfig:/gnu/store/1z9rjq9rzqzbjrvhba9fj0nxqa94rn7f-util-macros-1.19.0/lib/pkgconfig $_ENV['MAKEFLAGS'] => -j1 $_ENV['TEST_PHP_EXECUTABLE'] => /tmp/guix-build-php-7.0.14.drv-0/php-7.0.14/sapi/cli/php PHP License This program is free software; you can redistribute it and/or modify it under the terms of the PHP License as published by the PHP Group and included in the distribution in the file: LICENSE This program is distributed in the hope that it will be useful, but WITHOUT ANY WARRANTY; without even the implied warranty of MERCHANTABILITY or FITNESS FOR A PARTICULAR PURPOSE. If you did not receive a copy of the PHP license, or have any questions about PHP licensing, please contact license@php.net.
« previous php.qa.reports (#33931) next »