test report php 5.6.30
| From: | Ray Bon | Date: | Fri, 03 Feb 2017 22:50:28 +0000 |
| Subject: | test report php 5.6.30 | ||
| Groups: | php.qa.reports | ||
| Request: | Send a blank email to php-qa-reports+get-33943@lists.php.net to get a copy of this message | ||
--
Ray Bon
Programmer Analyst
Development Services, University Systems
2507218831 | CLE C023 | rbon@uvic.ca
===================================================================== EXPECTED FAILED TEST SUMMARY --------------------------------------------------------------------- Test open_basedir configuration [tests/security/open_basedir_linkinfo.phpt] XFAIL REASON: BUG: open_basedir cannot delete symlink to prohibited file. See also bugs 48111 and 52176. Inconsistencies when accessing protected members [Zend/tests/access_modifiers_008.phpt] XFAIL REASON: Discussion: http://marc.info/?l=php-internals&m=120221184420957&w=2 Inconsistencies when accessing protected members - 2 [Zend/tests/access_modifiers_009.phpt] XFAIL REASON: Discussion: http://marc.info/?l=php-internals&m=120221184420957&w=2 Bug #48770 (call_user_func_array() fails to call parent from inheriting class) [Zend/tests/bug48770.phpt] XFAIL REASON: See Bug #48770 Bug #48770 (call_user_func_array() fails to call parent from inheriting class) [Zend/tests/bug48770_2.phpt] XFAIL REASON: See Bug #48770 Bug #48770 (call_user_func_array() fails to call parent from inheriting class) [Zend/tests/bug48770_3.phpt] XFAIL REASON: See Bug #48770 Bug #64896 (Segfault with gc_collect_cycles using unserialize on certain objects) [Zend/tests/bug64896.phpt] XFAIL REASON: We can not fix this bug without a significant (performace slow down) change to gc Initial value of static var in method depends on the include time of the class definition [Zend/tests/method_static_var.phpt] XFAIL REASON: Maybe not a bug DateTime::add() -- fall type2 type3 [ext/date/tests/DateTime_add-fall-type2-type3.phpt] XFAIL REASON: Various bugs exist DateTime::add() -- fall type3 type2 [ext/date/tests/DateTime_add-fall-type3-type2.phpt] XFAIL REASON: Various bugs exist DateTime::add() -- fall type3 type3 [ext/date/tests/DateTime_add-fall-type3-type3.phpt] XFAIL REASON: Various bugs exist DateTime::add() -- spring type2 type3 [ext/date/tests/DateTime_add-spring-type2-type3.phpt] XFAIL REASON: Various bugs exist DateTime::add() -- spring type3 type2 [ext/date/tests/DateTime_add-spring-type3-type2.phpt] XFAIL REASON: Various bugs exist DateTime::add() -- spring type3 type3 [ext/date/tests/DateTime_add-spring-type3-type3.phpt] XFAIL REASON: Various bugs exist DateTime::diff() -- fall type2 type3 [ext/date/tests/DateTime_diff-fall-type2-type3.phpt] XFAIL REASON: Various bugs exist DateTime::diff() -- fall type3 type2 [ext/date/tests/DateTime_diff-fall-type3-type2.phpt] XFAIL REASON: Various bugs exist DateTime::diff() -- fall type3 type3 [ext/date/tests/DateTime_diff-fall-type3-type3.phpt] XFAIL REASON: Various bugs exist DateTime::diff() -- spring type2 type3 [ext/date/tests/DateTime_diff-spring-type2-type3.phpt] XFAIL REASON: Various bugs exist DateTime::diff() -- spring type3 type2 [ext/date/tests/DateTime_diff-spring-type3-type2.phpt] XFAIL REASON: Various bugs exist DateTime::diff() -- spring type3 type3 [ext/date/tests/DateTime_diff-spring-type3-type3.phpt] XFAIL REASON: Various bugs exist DateTime::sub() -- fall type2 type3 [ext/date/tests/DateTime_sub-fall-type2-type3.phpt] XFAIL REASON: Various bugs exist DateTime::sub() -- fall type3 type2 [ext/date/tests/DateTime_sub-fall-type3-type2.phpt] XFAIL REASON: Various bugs exist DateTime::sub() -- fall type3 type3 [ext/date/tests/DateTime_sub-fall-type3-type3.phpt] XFAIL REASON: Various bugs exist DateTime::sub() -- spring type2 type3 [ext/date/tests/DateTime_sub-spring-type2-type3.phpt] XFAIL REASON: Various bugs exist DateTime::sub() -- spring type3 type2 [ext/date/tests/DateTime_sub-spring-type3-type2.phpt] XFAIL REASON: Various bugs exist DateTime::sub() -- spring type3 type3 [ext/date/tests/DateTime_sub-spring-type3-type3.phpt] XFAIL REASON: Various bugs exist RFC: DateTime and Daylight Saving Time Transitions (zone type 3, bd2) [ext/date/tests/rfc-datetime_and_daylight_saving_time-type3-bd2.phpt] XFAIL REASON: Still not quite right RFC: DateTime and Daylight Saving Time Transitions (zone type 3, fs) [ext/date/tests/rfc-datetime_and_daylight_saving_time-type3-fs.phpt] XFAIL REASON: Still not quite right Bug #42718 (unsafe_raw filter not applied when configured as default filter) [ext/filter/tests/bug42718.phpt] XFAIL REASON: FILTER_UNSAFE_RAW not applied when configured as default filter, even with flags Bug #67296 (filter_input doesn't validate variables) [ext/filter/tests/bug49184.phpt] XFAIL REASON: See Bug #49184 Bug #67167: filter_var(null,FILTER_VALIDATE_BOOLEAN,FILTER_NULL_ON_FAILURE) returns null [ext/filter/tests/bug67167.02.phpt] XFAIL REASON: Requires php_zval_filter to not use convert_to_string for all filters. zend multibyte (7) [ext/mbstring/tests/zend_multibyte-07.phpt] XFAIL REASON: https://bugs.php.net/bug.php?id=66582 zend multibyte (9) [ext/mbstring/tests/zend_multibyte-09.phpt] XFAIL REASON: https://bugs.php.net/bug.php?id=66582 Bug #70470 (Built-in server truncates headers spanning over TCP packets) [sapi/cli/tests/bug70470.phpt] XFAIL REASON: bug is not fixed yet ===================================================================== ===================================================================== FAILED TEST SUMMARY --------------------------------------------------------------------- Bug #54268 (Double free when destroy_zend_class fails) [Zend/tests/bug54268.phpt] Bug #5547 (mysql_pconnect leaks file descriptors on reconnect) [ext/mysql/tests/bug55473.phpt] mysql_field_flags() [ext/mysql/tests/mysql_field_flags.phpt] LOAD DATA INFILE - open_basedir [ext/mysql/tests/mysql_query_load_data_openbasedir.phpt] file_get_contents() test using offset parameter out of range [ext/standard/tests/file/file_get_contents_error001.phpt] Test lstat() and stat() functions: usage variations - effects of is_dir() [ext/standard/tests/file/lstat_stat_variation10.phpt] ===================================================================== ===================================================================== WARNED TEST SUMMARY --------------------------------------------------------------------- zend multibyte (2) [ext/mbstring/tests/zend_multibyte-02.phpt] (warn: XFAIL section but test passes) zend multibyte (6) [ext/mbstring/tests/zend_multibyte-06.phpt] (warn: XFAIL section but test passes) zend multibyte (8) [ext/mbstring/tests/zend_multibyte-08.phpt] (warn: XFAIL section but test passes) zend multibyte (10) [ext/mbstring/tests/zend_multibyte-10.phpt] (warn: XFAIL section but test passes) zend multibyte (11) [ext/mbstring/tests/zend_multibyte-11.phpt] (warn: XFAIL section but test passes) Phar: bug #69958: Segfault in Phar::convertToData on invalid file [ext/phar/tests/bug69958.phpt] (warn: XFAIL section but test passes) Bug #69111 Crash in SessionHandler::read() [ext/session/tests/bug69111.phpt] (warn: XFAIL section but test passes) Bug #70172 - Use After Free Vulnerability in unserialize() [ext/standard/tests/serialize/bug70172.phpt] (warn: XFAIL section but test passes) Bug #72663: Create an Unexpected Object and Don't Invoke __wakeup() in Deserialization [ext/standard/tests/strings/bug72663_3.phpt] (warn: XFAIL section but test passes) ===================================================================== ===================================================================== TEST RESULT SUMMARY --------------------------------------------------------------------- Exts skipped : 38 Exts tested : 42 --------------------------------------------------------------------- Number of tests : 13920 11347 Tests skipped : 2573 ( 18.5%) -------- Tests warned : 9 ( 0.1%) ( 0.1%) Tests failed : 6 ( 0.0%) ( 0.1%) Expected fail : 34 ( 0.2%) ( 0.3%) Tests passed : 11298 ( 81.2%) ( 99.6%) --------------------------------------------------------------------- Time taken : 1405 seconds ===================================================================== ===================================================================== EXPECTED FAILED TEST SUMMARY --------------------------------------------------------------------- Test open_basedir configuration [tests/security/open_basedir_linkinfo.phpt] XFAIL REASON: BUG: open_basedir cannot delete symlink to prohibited file. See also bugs 48111 and 52176. Inconsistencies when accessing protected members [Zend/tests/access_modifiers_008.phpt] XFAIL REASON: Discussion: http://marc.info/?l=php-internals&m=120221184420957&w=2 Inconsistencies when accessing protected members - 2 [Zend/tests/access_modifiers_009.phpt] XFAIL REASON: Discussion: http://marc.info/?l=php-internals&m=120221184420957&w=2 Bug #48770 (call_user_func_array() fails to call parent from inheriting class) [Zend/tests/bug48770.phpt] XFAIL REASON: See Bug #48770 Bug #48770 (call_user_func_array() fails to call parent from inheriting class) [Zend/tests/bug48770_2.phpt] XFAIL REASON: See Bug #48770 Bug #48770 (call_user_func_array() fails to call parent from inheriting class) [Zend/tests/bug48770_3.phpt] XFAIL REASON: See Bug #48770 Bug #64896 (Segfault with gc_collect_cycles using unserialize on certain objects) [Zend/tests/bug64896.phpt] XFAIL REASON: We can not fix this bug without a significant (performace slow down) change to gc Initial value of static var in method depends on the include time of the class definition [Zend/tests/method_static_var.phpt] XFAIL REASON: Maybe not a bug DateTime::add() -- fall type2 type3 [ext/date/tests/DateTime_add-fall-type2-type3.phpt] XFAIL REASON: Various bugs exist DateTime::add() -- fall type3 type2 [ext/date/tests/DateTime_add-fall-type3-type2.phpt] XFAIL REASON: Various bugs exist DateTime::add() -- fall type3 type3 [ext/date/tests/DateTime_add-fall-type3-type3.phpt] XFAIL REASON: Various bugs exist DateTime::add() -- spring type2 type3 [ext/date/tests/DateTime_add-spring-type2-type3.phpt] XFAIL REASON: Various bugs exist DateTime::add() -- spring type3 type2 [ext/date/tests/DateTime_add-spring-type3-type2.phpt] XFAIL REASON: Various bugs exist DateTime::add() -- spring type3 type3 [ext/date/tests/DateTime_add-spring-type3-type3.phpt] XFAIL REASON: Various bugs exist DateTime::diff() -- fall type2 type3 [ext/date/tests/DateTime_diff-fall-type2-type3.phpt] XFAIL REASON: Various bugs exist DateTime::diff() -- fall type3 type2 [ext/date/tests/DateTime_diff-fall-type3-type2.phpt] XFAIL REASON: Various bugs exist DateTime::diff() -- fall type3 type3 [ext/date/tests/DateTime_diff-fall-type3-type3.phpt] XFAIL REASON: Various bugs exist DateTime::diff() -- spring type2 type3 [ext/date/tests/DateTime_diff-spring-type2-type3.phpt] XFAIL REASON: Various bugs exist DateTime::diff() -- spring type3 type2 [ext/date/tests/DateTime_diff-spring-type3-type2.phpt] XFAIL REASON: Various bugs exist DateTime::diff() -- spring type3 type3 [ext/date/tests/DateTime_diff-spring-type3-type3.phpt] XFAIL REASON: Various bugs exist DateTime::sub() -- fall type2 type3 [ext/date/tests/DateTime_sub-fall-type2-type3.phpt] XFAIL REASON: Various bugs exist DateTime::sub() -- fall type3 type2 [ext/date/tests/DateTime_sub-fall-type3-type2.phpt] XFAIL REASON: Various bugs exist DateTime::sub() -- fall type3 type3 [ext/date/tests/DateTime_sub-fall-type3-type3.phpt] XFAIL REASON: Various bugs exist DateTime::sub() -- spring type2 type3 [ext/date/tests/DateTime_sub-spring-type2-type3.phpt] XFAIL REASON: Various bugs exist DateTime::sub() -- spring type3 type2 [ext/date/tests/DateTime_sub-spring-type3-type2.phpt] XFAIL REASON: Various bugs exist DateTime::sub() -- spring type3 type3 [ext/date/tests/DateTime_sub-spring-type3-type3.phpt] XFAIL REASON: Various bugs exist RFC: DateTime and Daylight Saving Time Transitions (zone type 3, bd2) [ext/date/tests/rfc-datetime_and_daylight_saving_time-type3-bd2.phpt] XFAIL REASON: Still not quite right RFC: DateTime and Daylight Saving Time Transitions (zone type 3, fs) [ext/date/tests/rfc-datetime_and_daylight_saving_time-type3-fs.phpt] XFAIL REASON: Still not quite right Bug #42718 (unsafe_raw filter not applied when configured as default filter) [ext/filter/tests/bug42718.phpt] XFAIL REASON: FILTER_UNSAFE_RAW not applied when configured as default filter, even with flags Bug #67296 (filter_input doesn't validate variables) [ext/filter/tests/bug49184.phpt] XFAIL REASON: See Bug #49184 Bug #67167: filter_var(null,FILTER_VALIDATE_BOOLEAN,FILTER_NULL_ON_FAILURE) returns null [ext/filter/tests/bug67167.02.phpt] XFAIL REASON: Requires php_zval_filter to not use convert_to_string for all filters. zend multibyte (7) [ext/mbstring/tests/zend_multibyte-07.phpt] XFAIL REASON: https://bugs.php.net/bug.php?id=66582 zend multibyte (9) [ext/mbstring/tests/zend_multibyte-09.phpt] XFAIL REASON: https://bugs.php.net/bug.php?id=66582 Bug #70470 (Built-in server truncates headers spanning over TCP packets) [sapi/cli/tests/bug70470.phpt] XFAIL REASON: bug is not fixed yet ===================================================================== ===================================================================== FAILED TEST SUMMARY --------------------------------------------------------------------- Bug #54268 (Double free when destroy_zend_class fails) [Zend/tests/bug54268.phpt] Bug #5547 (mysql_pconnect leaks file descriptors on reconnect) [ext/mysql/tests/bug55473.phpt] mysql_field_flags() [ext/mysql/tests/mysql_field_flags.phpt] LOAD DATA INFILE - open_basedir [ext/mysql/tests/mysql_query_load_data_openbasedir.phpt] file_get_contents() test using offset parameter out of range [ext/standard/tests/file/file_get_contents_error001.phpt] Test lstat() and stat() functions: usage variations - effects of is_dir() [ext/standard/tests/file/lstat_stat_variation10.phpt] ===================================================================== ===================================================================== WARNED TEST SUMMARY --------------------------------------------------------------------- zend multibyte (2) [ext/mbstring/tests/zend_multibyte-02.phpt] (warn: XFAIL section but test passes) zend multibyte (6) [ext/mbstring/tests/zend_multibyte-06.phpt] (warn: XFAIL section but test passes) zend multibyte (8) [ext/mbstring/tests/zend_multibyte-08.phpt] (warn: XFAIL section but test passes) zend multibyte (10) [ext/mbstring/tests/zend_multibyte-10.phpt] (warn: XFAIL section but test passes) zend multibyte (11) [ext/mbstring/tests/zend_multibyte-11.phpt] (warn: XFAIL section but test passes) Phar: bug #69958: Segfault in Phar::convertToData on invalid file [ext/phar/tests/bug69958.phpt] (warn: XFAIL section but test passes) Bug #69111 Crash in SessionHandler::read() [ext/session/tests/bug69111.phpt] (warn: XFAIL section but test passes) Bug #70172 - Use After Free Vulnerability in unserialize() [ext/standard/tests/serialize/bug70172.phpt] (warn: XFAIL section but test passes) Bug #72663: Create an Unexpected Object and Don't Invoke __wakeup() in Deserialization [ext/standard/tests/strings/bug72663_3.phpt] (warn: XFAIL section but test passes) ===================================================================== ================================================================================ /home/rbon/Downloads/temp/php-5.6.30/Zend/tests/bug54268.phpt ================================================================================ ================================================================================ 001+ 001- Fatal error: Allowed memory size of %s bytes exhausted%s(tried to allocate %s bytes) in %s on line %d ================================================================================ ================================================================================ /home/rbon/Downloads/temp/php-5.6.30/ext/mysql/tests/bug55473.phpt ================================================================================ Deprecated: mysql_pconnect(): The mysql extension is deprecated and will be removed in the future: use mysqli or PDO instead in /home/rbon/Downloads/temp/php-5.6.30/ext/mysql/tests/bug55473.php on line 13 [003] reconnect 0 Deprecated: mysql_pconnect(): The mysql extension is deprecated and will be removed in the future: use mysqli or PDO instead in /home/rbon/Downloads/temp/php-5.6.30/ext/mysql/tests/bug55473.php on line 13 [005] Setting openened files... [003] reconnect 1 Deprecated: mysql_pconnect(): The mysql extension is deprecated and will be removed in the future: use mysqli or PDO instead in /home/rbon/Downloads/temp/php-5.6.30/ext/mysql/tests/bug55473.php on line 13 [007] Opened files as expected [003] reconnect 2 Deprecated: mysql_pconnect(): The mysql extension is deprecated and will be removed in the future: use mysqli or PDO instead in /home/rbon/Downloads/temp/php-5.6.30/ext/mysql/tests/bug55473.php on line 13 [007] Opened files as expected [003] reconnect 3 Deprecated: mysql_pconnect(): The mysql extension is deprecated and will be removed in the future: use mysqli or PDO instead in /home/rbon/Downloads/temp/php-5.6.30/ext/mysql/tests/bug55473.php on line 13 [007] Opened files as expected done! ================================================================================ 002- 003- Warning: mysql_ping(): MySQL server has gone away in %s on line %d 006+ [003] reconnect 1 008+ Deprecated: mysql_pconnect(): The mysql extension is deprecated and will be removed in the future: use mysqli or PDO instead in /home/rbon/Downloads/temp/php-5.6.30/ext/mysql/tests/bug55473.php on line 13 009+ [007] Opened files as expected 010+ [003] reconnect 2 011+ 012+ Deprecated: mysql_pconnect(): The mysql extension is deprecated and will be removed in the future: use mysqli or PDO instead in /home/rbon/Downloads/temp/php-5.6.30/ext/mysql/tests/bug55473.php on line 13 013+ [007] Opened files as expected 014+ [003] reconnect 3 009- Warning: mysql_ping(): MySQL server has gone away in %s on line %d 010- [003] reconnect 1 014- 018+ done! 015- Warning: mysql_ping(): MySQL server has gone away in %s on line %d 016- [003] reconnect 2 017- 018- Deprecated: mysql_pconnect(): The mysql extension is deprecated and will be removed in the future: use mysqli or PDO instead in %s on line %d 019- [007] Opened files as expected 020- 021- Warning: mysql_ping(): MySQL server has gone away in %s on line %d 022- [003] reconnect 3 023- 024- Deprecated: mysql_pconnect(): The mysql extension is deprecated and will be removed in the future: use mysqli or PDO instead in %s on line %d 025- [007] Opened files as expected 026- done! ================================================================================ ================================================================================ /home/rbon/Downloads/temp/php-5.6.30/ext/mysql/tests/mysql_field_flags.phpt ================================================================================ Deprecated: mysql_connect(): The mysql extension is deprecated and will be removed in the future: use mysqli or PDO instead in /home/rbon/Downloads/temp/php-5.6.30/ext/mysql/tests/connect.inc on line 37 Warning: mysql_field_flags() expects exactly 2 parameters, 1 given in /home/rbon/Downloads/temp/php-5.6.30/ext/mysql/tests/mysql_field_flags.php on line 18 Warning: mysql_field_flags(): Field -1 is invalid for MySQL result index 8 in /home/rbon/Downloads/temp/php-5.6.30/ext/mysql/tests/mysql_field_flags.php on line 21 Warning: mysql_field_flags(): Field 2 is invalid for MySQL result index 8 in /home/rbon/Downloads/temp/php-5.6.30/ext/mysql/tests/mysql_field_flags.php on line 32 [013/label1 TIMESTAMP] Field 'label1', flag 'zerofill' not found, [0] Warning: mysql_field_flags(): 15 is not a valid MySQL result resource in /home/rbon/Downloads/temp/php-5.6.30/ext/mysql/tests/mysql_field_flags.php on line 129 bool(false) done! ================================================================================ 008+ [013/label1 TIMESTAMP] Field 'label1', flag 'zerofill' not found, [0] ================================================================================ ================================================================================ /home/rbon/Downloads/temp/php-5.6.30/ext/mysql/tests/mysql_query_load_data_openbasedir.phpt ================================================================================ Deprecated: mysql_connect(): The mysql extension is deprecated and will be removed in the future: use mysqli or PDO instead in /home/rbon/Downloads/temp/php-5.6.30/ext/mysql/tests/connect.inc on line 37 Deprecated: mysql_connect(): The mysql extension is deprecated and will be removed in the future: use mysqli or PDO instead in /home/rbon/Downloads/temp/php-5.6.30/ext/mysql/tests/mysql_query_load_data_openbasedir.php on line 21 [010] [2000] open_basedir restriction in effect. Unable to open file done! ================================================================================ 004+ [010] [2000] open_basedir restriction in effect. Unable to open file 004- [006] [1148] %s 005- [007] [0] '' 006- [008] LOAD DATA not run? 007- [010] [1148] %s ================================================================================ ================================================================================ /home/rbon/Downloads/temp/php-5.6.30/ext/standard/tests/file/file_get_contents_error001.phpt ================================================================================ ** ERROR: process timed out ** ================================================================================ 001+ ** ERROR: process timed out ** 001- bool(false) ================================================================================ ================================================================================ /home/rbon/Downloads/temp/php-5.6.30/ext/standard/tests/file/lstat_stat_variation10.phpt ================================================================================ *** Testing stat() on directory after using is_dir() on it *** bool(true) bool(true) bool(true) Error: stat1 do not match with stat2 at key value: 8 Error: stat1 do not match with stat2 at key value: atime Dumping stat array 1... array(26) { [0]=> int(64771) [1]=> int(8264509) [2]=> int(16893) [3]=> int(2) [4]=> int(1000) [5]=> int(1000) [6]=> int(0) [7]=> int(4096) [8]=> int(1486161005) [9]=> int(1486161005) [10]=> int(1486161005) [11]=> int(4096) [12]=> int(8) ["dev"]=> int(64771) ["ino"]=> int(8264509) ["mode"]=> int(16893) ["nlink"]=> int(2) ["uid"]=> int(1000) ["gid"]=> int(1000) ["rdev"]=> int(0) ["size"]=> int(4096) ["atime"]=> int(1486161005) ["mtime"]=> int(1486161005) ["ctime"]=> int(1486161005) ["blksize"]=> int(4096) ["blocks"]=> int(8) } Dumping stat array 2... array(26) { [0]=> int(64771) [1]=> int(8264509) [2]=> int(16893) [3]=> int(2) [4]=> int(1000) [5]=> int(1000) [6]=> int(0) [7]=> int(4096) [8]=> int(1486161007) [9]=> int(1486161005) [10]=> int(1486161005) [11]=> int(4096) [12]=> int(8) ["dev"]=> int(64771) ["ino"]=> int(8264509) ["mode"]=> int(16893) ["nlink"]=> int(2) ["uid"]=> int(1000) ["gid"]=> int(1000) ["rdev"]=> int(0) ["size"]=> int(4096) ["atime"]=> int(1486161007) ["mtime"]=> int(1486161005) ["ctime"]=> int(1486161005) ["blksize"]=> int(4096) ["blocks"]=> int(8) } bool(false) --- Done --- ================================================================================ 005+ Error: stat1 do not match with stat2 at key value: 8 006+ Error: stat1 do not match with stat2 at key value: atime 005- bool(true) 007- --- Done --- 008+ Dumping stat array 1... 009+ array(26) { 010+ [0]=> 011+ int(64771) 012+ [1]=> 013+ int(8264509) 014+ [2]=> 015+ int(16893) 016+ [3]=> 017+ int(2) 018+ [4]=> 019+ int(1000) 020+ [5]=> 021+ int(1000) 022+ [6]=> 023+ int(0) 024+ [7]=> 025+ int(4096) 026+ [8]=> 027+ int(1486161005) 028+ [9]=> 029+ int(1486161005) 030+ [10]=> 031+ int(1486161005) 032+ [11]=> 033+ int(4096) 034+ [12]=> 035+ int(8) 036+ ["dev"]=> 037+ int(64771) 038+ ["ino"]=> 039+ int(8264509) 040+ ["mode"]=> 041+ int(16893) 042+ ["nlink"]=> 043+ int(2) 044+ ["uid"]=> 045+ int(1000) 046+ ["gid"]=> 047+ int(1000) 048+ ["rdev"]=> 049+ int(0) 050+ ["size"]=> 051+ int(4096) 052+ ["atime"]=> 053+ int(1486161005) 054+ ["mtime"]=> 055+ int(1486161005) 056+ ["ctime"]=> 057+ int(1486161005) 058+ ["blksize"]=> 059+ int(4096) 060+ ["blocks"]=> 061+ int(8) 062+ } 063+ 064+ Dumping stat array 2... 065+ array(26) { 066+ [0]=> 067+ int(64771) 068+ [1]=> 069+ int(8264509) 070+ [2]=> 071+ int(16893) 072+ [3]=> 073+ int(2) 074+ [4]=> 075+ int(1000) 076+ [5]=> 077+ int(1000) 078+ [6]=> 079+ int(0) 080+ [7]=> 081+ int(4096) 082+ [8]=> 083+ int(1486161007) 084+ [9]=> 085+ int(1486161005) 086+ [10]=> 087+ int(1486161005) 088+ [11]=> 089+ int(4096) 090+ [12]=> 091+ int(8) 092+ ["dev"]=> 093+ int(64771) 094+ ["ino"]=> 095+ int(8264509) 096+ ["mode"]=> 097+ int(16893) 098+ ["nlink"]=> 099+ int(2) 100+ ["uid"]=> 101+ int(1000) 102+ ["gid"]=> 103+ int(1000) 104+ ["rdev"]=> 105+ int(0) 106+ ["size"]=> 107+ int(4096) 108+ ["atime"]=> 109+ int(1486161007) 110+ ["mtime"]=> 111+ int(1486161005) 112+ ["ctime"]=> 113+ int(1486161005) 114+ ["blksize"]=> 115+ int(4096) 116+ ["blocks"]=> 117+ int(8) 118+ } 119+ bool(false) 120+ 121+ --- Done --- ================================================================================ ================================================================================ BUILD ENVIRONMENT ================================================================================ OS: Linux - Linux localhost.localdomainq 4.9.5-200.fc25.x86_64 #1 SMP Fri Jan 20 12:24:16 UTC 2017 x86_64 Autoconf: autoconf (GNU Autoconf) 2.69 Copyright (C) 2012 Free Software Foundation, Inc. License GPLv3+/Autoconf: GNU GPL version 3 or later <http://gnu.org/licenses/gpl.html>, <http://gnu.org/licenses/exceptions.html> This is free software: you are free to change and redistribute it. There is NO WARRANTY, to the extent permitted by law. Written by David J. MacKenzie and Akim Demaille. Bundled Libtool: ltmain.sh (GNU libtool) 1.5.26 (1.1220.2.492 2008/01/30 06:40:56) Copyright (C) 2008 Free Software Foundation, Inc. This is free software; see the source for copying conditions. There is NO warranty; not even for MERCHANTABILITY or FITNESS FOR A PARTICULAR PURPOSE. System Libtool: ltmain.sh (GNU libtool) 1.5.26 (1.1220.2.492 2008/01/30 06:40:56) Copyright (C) 2008 Free Software Foundation, Inc. This is free software; see the source for copying conditions. There is NO warranty; not even for MERCHANTABILITY or FITNESS FOR A PARTICULAR PURPOSE. Compiler: Using built-in specs. COLLECT_GCC=cc COLLECT_LTO_WRAPPER=/usr/libexec/gcc/x86_64-redhat-linux/6.3.1/lto-wrapper Target: x86_64-redhat-linux Configured with: ../configure --enable-bootstrap --enable-languages=c,c++,objc,obj-c++,fortran,ada,go,lto --prefix=/usr --mandir=/usr/share/man --infodir=/usr/share/info --with-bugurl=http://bugzilla.redhat.com/bugzilla --enable-shared --enable-threads=posix --enable-checking=release --enable-multilib --with-system-zlib --enable-__cxa_atexit --disable-libunwind-exceptions --enable-gnu-unique-object --enable-linker-build-id --with-linker-hash-style=gnu --enable-plugin --enable-initfini-array --disable-libgcj --with-isl --enable-libmpx --enable-gnu-indirect-function --with-tune=generic --with-arch_32=i686 --build=x86_64-redhat-linux Thread model: posix gcc version 6.3.1 20161221 (Red Hat 6.3.1-1) (GCC) Bison: Libraries: linux-vdso.so.1 (0x00007ffe14f2c000) libcrypt.so.1 => /lib64/libcrypt.so.1 (0x00007fda1ec5b000) libz.so.1 => /lib64/libz.so.1 (0x00007fda1ea45000) libexslt.so.0 => /lib64/libexslt.so.0 (0x00007fda1e82f000) libresolv.so.2 => /lib64/libresolv.so.2 (0x00007fda1e614000) libpq.so.5 => /lib64/libpq.so.5 (0x00007fda1e3e4000) librt.so.1 => /lib64/librt.so.1 (0x00007fda1e1da000) libldap-2.4.so.2 => /lib64/libldap-2.4.so.2 (0x00007fda1df89000) liblber-2.4.so.2 => /lib64/liblber-2.4.so.2 (0x00007fda1dd7a000) libstdc++.so.6 => /lib64/libstdc++.so.6 (0x00007fda1d9f2000) libpng16.so.16 => /lib64/libpng16.so.16 (0x00007fda1d7bf000) libjpeg.so.62 => /lib64/libjpeg.so.62 (0x00007fda1d555000) libcurl.so.4 => /lib64/libcurl.so.4 (0x00007fda1d2d5000) libm.so.6 => /lib64/libm.so.6 (0x00007fda1cfcc000) libdl.so.2 => /lib64/libdl.so.2 (0x00007fda1cdc8000) libnsl.so.1 => /lib64/libnsl.so.1 (0x00007fda1cbaf000) libxml2.so.2 => /lib64/libxml2.so.2 (0x00007fda1c848000) libgssapi_krb5.so.2 => /lib64/libgssapi_krb5.so.2 (0x00007fda1c5fb000) libkrb5.so.3 => /lib64/libkrb5.so.3 (0x00007fda1c313000) libk5crypto.so.3 => /lib64/libk5crypto.so.3 (0x00007fda1c0e2000) libcom_err.so.2 => /lib64/libcom_err.so.2 (0x00007fda1bede000) libssl.so.10 => /lib64/libssl.so.10 (0x00007fda1bc6c000) libcrypto.so.10 => /lib64/libcrypto.so.10 (0x00007fda1b80c000) libfreetype.so.6 => /lib64/libfreetype.so.6 (0x00007fda1b561000) libicui18n.so.57 => /lib64/libicui18n.so.57 (0x00007fda1b0e7000) libicuuc.so.57 => /lib64/libicuuc.so.57 (0x00007fda1ad3e000) libicudata.so.57 => /lib64/libicudata.so.57 (0x00007fda192c1000) libicuio.so.57 => /lib64/libicuio.so.57 (0x00007fda190b3000) libxslt.so.1 => /lib64/libxslt.so.1 (0x00007fda18e74000) libgcc_s.so.1 => /lib64/libgcc_s.so.1 (0x00007fda18c5d000) libc.so.6 => /lib64/libc.so.6 (0x00007fda18895000) libfreebl3.so => /lib64/libfreebl3.so (0x00007fda18692000) libgcrypt.so.20 => /lib64/libgcrypt.so.20 (0x00007fda183ac000) libgpg-error.so.0 => /lib64/libgpg-error.so.0 (0x00007fda18198000) libldap_r-2.4.so.2 => /lib64/libldap_r-2.4.so.2 (0x00007fda17f3e000) libpthread.so.0 => /lib64/libpthread.so.0 (0x00007fda17d20000) libsasl2.so.3 => /lib64/libsasl2.so.3 (0x00007fda17b01000) libssl3.so => /lib64/libssl3.so (0x00007fda178b5000) libsmime3.so => /lib64/libsmime3.so (0x00007fda1768e000) libnss3.so => /lib64/libnss3.so (0x00007fda17364000) libnssutil3.so => /lib64/libnssutil3.so (0x00007fda17136000) libplds4.so => /lib64/libplds4.so (0x00007fda16f32000) libplc4.so => /lib64/libplc4.so (0x00007fda16d2b000) libnspr4.so => /lib64/libnspr4.so (0x00007fda16aec000) /lib64/ld-linux-x86-64.so.2 (0x0000563b61eb3000) libnghttp2.so.14 => /lib64/libnghttp2.so.14 (0x00007fda168c7000) libidn2.so.0 => /lib64/libidn2.so.0 (0x00007fda16690000) libssh2.so.1 => /lib64/libssh2.so.1 (0x00007fda16463000) libpsl.so.5 => /lib64/libpsl.so.5 (0x00007fda16255000) liblzma.so.5 => /lib64/liblzma.so.5 (0x00007fda1602d000) libkrb5support.so.0 => /lib64/libkrb5support.so.0 (0x00007fda15e1e000) libkeyutils.so.1 => /lib64/libkeyutils.so.1 (0x00007fda15c1a000) libbz2.so.1 => /lib64/libbz2.so.1 (0x00007fda15a0a000) libunistring.so.2 => /lib64/libunistring.so.2 (0x00007fda156d8000) libselinux.so.1 => /lib64/libselinux.so.1 (0x00007fda154b1000) libpcre.so.1 => /lib64/libpcre.so.1 (0x00007fda1523e000) ================================================================================ PHPINFO ================================================================================ phpinfo() PHP Version => 5.6.30 System => Linux localhost.localdomainq 4.9.5-200.fc25.x86_64 #1 SMP Fri Jan 20 12:24:16 UTC 2017 x86_64 Build Date => Feb 3 2017 14:07:03 Configure Command => './configure' '--prefix=/opt/php/php-5.6.30' '--with-apxs2=/usr/local/apache2/bin/apxs' '--enable-mbstring' '--with-curl' '--with-openssl' '--with-xmlrpc' '--enable-soap' '--enable-zip' '--with-gd' '--with-jpeg-dir' '--with-png-dir' '--with-mysql' '--with-pgsql' '--enable-embedded-mysqli' '--with-freetype-dir' '--enable-intl' '--with-xsl' '--with-libdir=lib64' '--with-config-file-path=/opt/php/config/php-5.6.30' '--with-config-file-scan-dir=/opt/php/config/php-5.6.30/php.d' '--with-system-ciphers' '--with-zlib' '--with-kerberos' '--with-mhash' '--enable-dtrace' '--enable-phpdbg' '--with-ldap' Server API => Command Line Interface Virtual Directory Support => disabled Configuration File (php.ini) Path => /opt/php/config/php-5.6.30 Loaded Configuration File => (none) Scan this dir for additional .ini files => /opt/php/config/php-5.6.30/php.d Additional .ini files parsed => (none) PHP API => 20131106 PHP Extension => 20131226 Zend Extension => 220131226 Zend Extension Build => API220131226,NTS PHP Extension Build => API20131226,NTS Debug Build => no Thread Safety => disabled Zend Signal Handling => disabled Zend Memory Manager => enabled Zend Multibyte Support => provided by mbstring IPv6 Support => enabled DTrace Support => enabled Registered PHP Streams => https, ftps, compress.zlib, php, file, glob, data, http, ftp, phar, zip Registered Stream Socket Transports => tcp, udp, unix, udg, ssl, sslv3, tls, tlsv1.0, tlsv1.1, tlsv1.2 Registered Stream Filters => zlib.*, convert.iconv.*, string.rot13, string.toupper, string.tolower, string.strip_tags, convert.*, consumed, dechunk This program makes use of the Zend Scripting Language Engine: Zend Engine v2.6.0, Copyright (c) 1998-2016 Zend Technologies _______________________________________________________________________ Configuration Core PHP Version => 5.6.30 Directive => Local Value => Master Value allow_url_fopen => On => On allow_url_include => Off => Off always_populate_raw_post_data => 0 => 0 arg_separator.input => & => & arg_separator.output => & => & asp_tags => Off => Off auto_append_file => no value => no value auto_globals_jit => On => On auto_prepend_file => no value => no value browscap => no value => no value default_charset => UTF-8 => UTF-8 default_mimetype => text/html => text/html disable_classes => no value => no value disable_functions => no value => no value display_errors => STDERR => STDERR display_startup_errors => Off => Off doc_root => no value => no value docref_ext => no value => no value docref_root => no value => no value enable_dl => On => On enable_post_data_reading => On => On error_append_string => no value => no value error_log => no value => no value error_prepend_string => no value => no value error_reporting => no value => no value exit_on_timeout => Off => Off expose_php => On => On extension_dir => /opt/php/php-5.6.30/lib/php/extensions/no-debug-non-zts-20131226 => /opt/php/php-5.6.30/lib/php/extensions/no-debug-non-zts-20131226 file_uploads => On => On highlight.comment => <font style="color: #FF8000">#FF8000</font> => <font style="color: #FF8000">#FF8000</font> highlight.default => <font style="color: #0000BB">#0000BB</font> => <font style="color: #0000BB">#0000BB</font> highlight.html => <font style="color: #000000">#000000</font> => <font style="color: #000000">#000000</font> highlight.keyword => <font style="color: #007700">#007700</font> => <font style="color: #007700">#007700</font> highlight.string => <font style="color: #DD0000">#DD0000</font> => <font style="color: #DD0000">#DD0000</font> html_errors => Off => Off ignore_repeated_errors => Off => Off ignore_repeated_source => Off => Off ignore_user_abort => Off => Off implicit_flush => On => On include_path => .:/opt/php/php-5.6.30/lib/php => .:/opt/php/php-5.6.30/lib/php input_encoding => no value => no value internal_encoding => no value => no value log_errors => Off => Off log_errors_max_len => 1024 => 1024 mail.add_x_header => Off => Off mail.force_extra_parameters => no value => no value mail.log => no value => no value max_execution_time => 0 => 0 max_file_uploads => 20 => 20 max_input_nesting_level => 64 => 64 max_input_time => -1 => -1 max_input_vars => 1000 => 1000 memory_limit => 128M => 128M open_basedir => no value => no value output_buffering => 0 => 0 output_encoding => no value => no value output_handler => no value => no value post_max_size => 8M => 8M precision => 14 => 14 realpath_cache_size => 16K => 16K realpath_cache_ttl => 120 => 120 register_argc_argv => On => On report_memleaks => On => On report_zend_debug => Off => Off request_order => no value => no value sendmail_from => no value => no value sendmail_path => /usr/sbin/sendmail -t -i => /usr/sbin/sendmail -t -i serialize_precision => 17 => 17 short_open_tag => On => On SMTP => localhost => localhost smtp_port => 25 => 25 sql.safe_mode => Off => Off sys_temp_dir => no value => no value track_errors => Off => Off unserialize_callback_func => no value => no value upload_max_filesize => 2M => 2M upload_tmp_dir => no value => no value user_dir => no value => no value user_ini.cache_ttl => 300 => 300 user_ini.filename => .user.ini => .user.ini variables_order => EGPCS => EGPCS xmlrpc_error_number => 0 => 0 xmlrpc_errors => Off => Off zend.detect_unicode => On => On zend.enable_gc => On => On zend.multibyte => Off => Off zend.script_encoding => no value => no value ctype ctype functions => enabled curl cURL support => enabled cURL Information => 7.51.0 Age => 3 Features AsynchDNS => Yes CharConv => No Debug => No GSS-Negotiate => No IDN => Yes IPv6 => Yes krb4 => No Largefile => Yes libz => Yes NTLM => Yes NTLMWB => Yes SPNEGO => Yes SSL => Yes SSPI => No TLS-SRP => No Protocols => dict, file, ftp, ftps, gopher, http, https, imap, imaps, ldap, ldaps, pop3, pop3s, rtsp, scp, sftp, smb, smbs, smtp, smtps, telnet, tftp Host => x86_64-redhat-linux-gnu SSL Version => NSS/3.27 ZLib Version => 1.2.8 libSSH Version => libssh2/1.8.0 date date/time support => enabled "Olson" Timezone Database Version => 2016.10 Timezone Database => internal Default timezone => UTC Directive => Local Value => Master Value date.default_latitude => 31.7667 => 31.7667 date.default_longitude => 35.2333 => 35.2333 date.sunrise_zenith => 90.583333 => 90.583333 date.sunset_zenith => 90.583333 => 90.583333 date.timezone => no value => no value dom DOM/XML => enabled DOM/XML API Version => 20031129 libxml Version => 2.9.3 HTML Support => enabled XPath Support => enabled XPointer Support => enabled Schema Support => enabled RelaxNG Support => enabled ereg Regex Library => Bundled library enabled fileinfo fileinfo support => enabled version => 1.0.5 libmagic => 517 filter Input Validation and Filtering => enabled Revision => $Id: 5b79667bd9a68977a9b4f7505223a8e216e04908 $ Directive => Local Value => Master Value filter.default => unsafe_raw => unsafe_raw filter.default_flags => no value => no value gd GD Support => enabled GD Version => bundled (2.1.0 compatible) FreeType Support => enabled FreeType Linkage => with freetype FreeType Version => 2.6.5 GIF Read Support => enabled GIF Create Support => enabled JPEG Support => enabled libJPEG Version => 6b PNG Support => enabled libPNG Version => 1.6.27 WBMP Support => enabled XBM Support => enabled Directive => Local Value => Master Value gd.jpeg_ignore_warning => 0 => 0 hash hash support => enabled Hashing Engines => md2 md4 md5 sha1 sha224 sha256 sha384 sha512 ripemd128 ripemd160 ripemd256 ripemd320 whirlpool tiger128,3 tiger160,3 tiger192,3 tiger128,4 tiger160,4 tiger192,4 snefru snefru256 gost gost-crypto adler32 crc32 crc32b fnv132 fnv1a32 fnv164 fnv1a64 joaat haval128,3 haval160,3 haval192,3 haval224,3 haval256,3 haval128,4 haval160,4 haval192,4 haval224,4 haval256,4 haval128,5 haval160,5 haval192,5 haval224,5 haval256,5 iconv iconv support => enabled iconv implementation => glibc iconv library version => 2.24 Directive => Local Value => Master Value iconv.input_encoding => no value => no value iconv.internal_encoding => no value => no value iconv.output_encoding => no value => no value intl Internationalization support => enabled version => 1.1.0 ICU version => 57.1 ICU Data version => 57.1 Directive => Local Value => Master Value intl.default_locale => no value => no value intl.error_level => 0 => 0 intl.use_exceptions => 0 => 0 json json support => enabled json version => 1.2.1 ldap LDAP Support => enabled RCS Version => $Id: 8ab0fe072786e6f8d7dbd47b6a4897e81ce89ec3 $ Total Links => 0/unlimited API Version => 3001 Vendor Name => OpenLDAP Vendor Version => 20444 Directive => Local Value => Master Value ldap.max_links => Unlimited => Unlimited libxml libXML support => active libXML Compiled Version => 2.9.3 libXML Loaded Version => 20903 libXML streams => enabled mbstring Multibyte Support => enabled Multibyte string engine => libmbfl HTTP input encoding translation => disabled libmbfl version => 1.3.2 mbstring extension makes use of "streamable kanji code filter and converter", which is distributed under the GNU Lesser General Public License version 2.1. Multibyte (japanese) regex support => enabled Multibyte regex (oniguruma) backtrack check => On Multibyte regex (oniguruma) version => 5.9.5 Directive => Local Value => Master Value mbstring.detect_order => no value => no value mbstring.encoding_translation => Off => Off mbstring.func_overload => 0 => 0 mbstring.http_input => no value => no value mbstring.http_output => no value => no value mbstring.http_output_conv_mimetypes => ^(text/|application/xhtml\+xml) => ^(text/|application/xhtml\+xml) mbstring.internal_encoding => no value => no value mbstring.language => neutral => neutral mbstring.strict_detection => Off => Off mbstring.substitute_character => no value => no value mhash MHASH support => Enabled MHASH API Version => Emulated Support mysql MySQL Support => enabled Active Persistent Links => 0 Active Links => 0 Client API version => mysqlnd 5.0.11-dev - 20120503 - $Id: 76b08b24596e12d4553bd41fc93cccd5bac2fe7a $ Directive => Local Value => Master Value mysql.allow_local_infile => On => On mysql.allow_persistent => On => On mysql.connect_timeout => 60 => 60 mysql.default_host => no value => no value mysql.default_password => no value => no value mysql.default_port => no value => no value mysql.default_socket => /var/lib/mysql/mysql.sock => /var/lib/mysql/mysql.sock mysql.default_user => no value => no value mysql.max_links => Unlimited => Unlimited mysql.max_persistent => Unlimited => Unlimited mysql.trace_mode => Off => Off mysqlnd mysqlnd => enabled Version => mysqlnd 5.0.11-dev - 20120503 - $Id: 76b08b24596e12d4553bd41fc93cccd5bac2fe7a $ Compression => supported core SSL => supported extended SSL => supported Command buffer size => 4096 Read buffer size => 32768 Read timeout => 31536000 Collecting statistics => Yes Collecting memory statistics => No Tracing => n/a Loaded plugins => mysqlnd,debug_trace,auth_plugin_mysql_native_password,auth_plugin_mysql_clear_password,auth_plugin_sha256_password API Extensions => mysql mysqlnd statistics => bytes_sent => 0 bytes_received => 0 packets_sent => 0 packets_received => 0 protocol_overhead_in => 0 protocol_overhead_out => 0 bytes_received_ok_packet => 0 bytes_received_eof_packet => 0 bytes_received_rset_header_packet => 0 bytes_received_rset_field_meta_packet => 0 bytes_received_rset_row_packet => 0 bytes_received_prepare_response_packet => 0 bytes_received_change_user_packet => 0 packets_sent_command => 0 packets_received_ok => 0 packets_received_eof => 0 packets_received_rset_header => 0 packets_received_rset_field_meta => 0 packets_received_rset_row => 0 packets_received_prepare_response => 0 packets_received_change_user => 0 result_set_queries => 0 non_result_set_queries => 0 no_index_used => 0 bad_index_used => 0 slow_queries => 0 buffered_sets => 0 unbuffered_sets => 0 ps_buffered_sets => 0 ps_unbuffered_sets => 0 flushed_normal_sets => 0 flushed_ps_sets => 0 ps_prepared_never_executed => 0 ps_prepared_once_executed => 0 rows_fetched_from_server_normal => 0 rows_fetched_from_server_ps => 0 rows_buffered_from_client_normal => 0 rows_buffered_from_client_ps => 0 rows_fetched_from_client_normal_buffered => 0 rows_fetched_from_client_normal_unbuffered => 0 rows_fetched_from_client_ps_buffered => 0 rows_fetched_from_client_ps_unbuffered => 0 rows_fetched_from_client_ps_cursor => 0 rows_affected_normal => 0 rows_affected_ps => 0 rows_skipped_normal => 0 rows_skipped_ps => 0 copy_on_write_saved => 0 copy_on_write_performed => 0 command_buffer_too_small => 0 connect_success => 0 connect_failure => 0 connection_reused => 0 reconnect => 0 pconnect_success => 0 active_connections => 0 active_persistent_connections => 0 explicit_close => 0 implicit_close => 0 disconnect_close => 0 in_middle_of_command_close => 0 explicit_free_result => 0 implicit_free_result => 0 explicit_stmt_close => 0 implicit_stmt_close => 0 mem_emalloc_count => 0 mem_emalloc_amount => 0 mem_ecalloc_count => 0 mem_ecalloc_amount => 0 mem_erealloc_count => 0 mem_erealloc_amount => 0 mem_efree_count => 0 mem_efree_amount => 0 mem_malloc_count => 0 mem_malloc_amount => 0 mem_calloc_count => 0 mem_calloc_amount => 0 mem_realloc_count => 0 mem_realloc_amount => 0 mem_free_count => 0 mem_free_amount => 0 mem_estrndup_count => 0 mem_strndup_count => 0 mem_estndup_count => 0 mem_strdup_count => 0 proto_text_fetched_null => 0 proto_text_fetched_bit => 0 proto_text_fetched_tinyint => 0 proto_text_fetched_short => 0 proto_text_fetched_int24 => 0 proto_text_fetched_int => 0 proto_text_fetched_bigint => 0 proto_text_fetched_decimal => 0 proto_text_fetched_float => 0 proto_text_fetched_double => 0 proto_text_fetched_date => 0 proto_text_fetched_year => 0 proto_text_fetched_time => 0 proto_text_fetched_datetime => 0 proto_text_fetched_timestamp => 0 proto_text_fetched_string => 0 proto_text_fetched_blob => 0 proto_text_fetched_enum => 0 proto_text_fetched_set => 0 proto_text_fetched_geometry => 0 proto_text_fetched_other => 0 proto_binary_fetched_null => 0 proto_binary_fetched_bit => 0 proto_binary_fetched_tinyint => 0 proto_binary_fetched_short => 0 proto_binary_fetched_int24 => 0 proto_binary_fetched_int => 0 proto_binary_fetched_bigint => 0 proto_binary_fetched_decimal => 0 proto_binary_fetched_float => 0 proto_binary_fetched_double => 0 proto_binary_fetched_date => 0 proto_binary_fetched_year => 0 proto_binary_fetched_time => 0 proto_binary_fetched_datetime => 0 proto_binary_fetched_timestamp => 0 proto_binary_fetched_string => 0 proto_binary_fetched_json => 0 proto_binary_fetched_blob => 0 proto_binary_fetched_enum => 0 proto_binary_fetched_set => 0 proto_binary_fetched_geometry => 0 proto_binary_fetched_other => 0 init_command_executed_count => 0 init_command_failed_count => 0 com_quit => 0 com_init_db => 0 com_query => 0 com_field_list => 0 com_create_db => 0 com_drop_db => 0 com_refresh => 0 com_shutdown => 0 com_statistics => 0 com_process_info => 0 com_connect => 0 com_process_kill => 0 com_debug => 0 com_ping => 0 com_time => 0 com_delayed_insert => 0 com_change_user => 0 com_binlog_dump => 0 com_table_dump => 0 com_connect_out => 0 com_register_slave => 0 com_stmt_prepare => 0 com_stmt_execute => 0 com_stmt_send_long_data => 0 com_stmt_close => 0 com_stmt_reset => 0 com_stmt_set_option => 0 com_stmt_fetch => 0 com_deamon => 0 bytes_received_real_data_normal => 0 bytes_received_real_data_ps => 0 openssl OpenSSL support => enabled OpenSSL Library Version => OpenSSL 1.0.2j-fips 26 Sep 2016 OpenSSL Header Version => OpenSSL 1.0.2j-fips 26 Sep 2016 Openssl default config => /etc/pki/tls/openssl.cnf Directive => Local Value => Master Value openssl.cafile => no value => no value openssl.capath => no value => no value pcre PCRE (Perl Compatible Regular Expressions) Support => enabled PCRE Library Version => 8.38 2015-11-23 Directive => Local Value => Master Value pcre.backtrack_limit => 1000000 => 1000000 pcre.recursion_limit => 100000 => 100000 PDO PDO support => enabled PDO drivers => sqlite pdo_sqlite PDO Driver for SQLite 3.x => enabled SQLite Library => 3.8.10.2 pgsql PostgreSQL Support => enabled PostgreSQL(libpq) Version => 9.5.5 PostgreSQL(libpq) => PostgreSQL 9.5.5 on x86_64-redhat-linux-gnu, compiled by gcc (GCC) 6.2.1 20160916 (Red Hat 6.2.1-2), 64-bit Multibyte character support => enabled SSL support => enabled Active Persistent Links => 0 Active Links => 0 Directive => Local Value => Master Value pgsql.allow_persistent => On => On pgsql.auto_reset_persistent => Off => Off pgsql.ignore_notice => Off => Off pgsql.log_notice => Off => Off pgsql.max_links => Unlimited => Unlimited pgsql.max_persistent => Unlimited => Unlimited Phar Phar: PHP Archive support => enabled Phar EXT version => 2.0.2 Phar API version => 1.1.1 SVN revision => $Id: 780be432570e80dd34c1a9c217ef87ade22bf136 $ Phar-based phar archives => enabled Tar-based phar archives => enabled ZIP-based phar archives => enabled gzip compression => enabled bzip2 compression => disabled (install pecl/bz2) Native OpenSSL support => enabled Phar based on pear/PHP_Archive, original concept by Davey Shafik. Phar fully realized by Gregory Beaver and Marcus Boerger. Portions of tar implementation Copyright (c) 2003-2009 Tim Kientzle. Directive => Local Value => Master Value phar.cache_list => no value => no value phar.readonly => On => On phar.require_hash => On => On posix Revision => $Id: 5f4acc20904b1406142f2a0ede068db048c77e77 $ Reflection Reflection => enabled Version => $Id: 5f15287237d5f78d75b19c26915aa7bd83dee8b8 $ session Session Support => enabled Registered save handlers => files user Registered serializer handlers => php_serialize php php_binary Directive => Local Value => Master Value session.auto_start => Off => Off session.cache_expire => 180 => 180 session.cache_limiter => nocache => nocache session.cookie_domain => no value => no value session.cookie_httponly => Off => Off session.cookie_lifetime => 0 => 0 session.cookie_path => / => / session.cookie_secure => Off => Off session.entropy_file => /dev/urandom => /dev/urandom session.entropy_length => 32 => 32 session.gc_divisor => 100 => 100 session.gc_maxlifetime => 1440 => 1440 session.gc_probability => 1 => 1 session.hash_bits_per_character => 4 => 4 session.hash_function => 0 => 0 session.name => PHPSESSID => PHPSESSID session.referer_check => no value => no value session.save_handler => files => files session.save_path => no value => no value session.serialize_handler => php => php session.upload_progress.cleanup => On => On session.upload_progress.enabled => On => On session.upload_progress.freq => 1% => 1% session.upload_progress.min_freq => 1 => 1 session.upload_progress.name => PHP_SESSION_UPLOAD_PROGRESS => PHP_SESSION_UPLOAD_PROGRESS session.upload_progress.prefix => upload_progress_ => upload_progress_ session.use_cookies => On => On session.use_only_cookies => On => On session.use_strict_mode => Off => Off session.use_trans_sid => 0 => 0 SimpleXML Simplexml support => enabled Revision => $Id: d7077fc935154236afb4fe70814ba358efdbdca4 $ Schema support => enabled soap Soap Client => enabled Soap Server => enabled Directive => Local Value => Master Value soap.wsdl_cache => 1 => 1 soap.wsdl_cache_dir => /tmp => /tmp soap.wsdl_cache_enabled => 1 => 1 soap.wsdl_cache_limit => 5 => 5 soap.wsdl_cache_ttl => 86400 => 86400 SPL SPL support => enabled Interfaces => Countable, OuterIterator, RecursiveIterator, SeekableIterator, SplObserver, SplSubject Classes => AppendIterator, ArrayIterator, ArrayObject, BadFunctionCallException, BadMethodCallException, CachingIterator, CallbackFilterIterator, DirectoryIterator, DomainException, EmptyIterator, FilesystemIterator, FilterIterator, GlobIterator, InfiniteIterator, InvalidArgumentException, IteratorIterator, LengthException, LimitIterator, LogicException, MultipleIterator, NoRewindIterator, OutOfBoundsException, OutOfRangeException, OverflowException, ParentIterator, RangeException, RecursiveArrayIterator, RecursiveCachingIterator, RecursiveCallbackFilterIterator, RecursiveDirectoryIterator, RecursiveFilterIterator, RecursiveIteratorIterator, RecursiveRegexIterator, RecursiveTreeIterator, RegexIterator, RuntimeException, SplDoublyLinkedList, SplFileInfo, SplFileObject, SplFixedArray, SplHeap, SplMinHeap, SplMaxHeap, SplObjectStorage, SplPriorityQueue, SplQueue, SplStack, SplTempFileObject, UnderflowException, UnexpectedValueException sqlite3 SQLite3 support => enabled SQLite3 module version => 0.7-dev SQLite Library => 3.8.10.2 Directive => Local Value => Master Value sqlite3.extension_dir => no value => no value standard Dynamic Library Support => enabled Path to sendmail => /usr/sbin/sendmail -t -i Directive => Local Value => Master Value assert.active => 1 => 1 assert.bail => 0 => 0 assert.callback => no value => no value assert.quiet_eval => 0 => 0 assert.warning => 1 => 1 auto_detect_line_endings => 0 => 0 default_socket_timeout => 60 => 60 from => no value => no value url_rewriter.tags => a=href,area=href,frame=src,form=,fieldset= => a=href,area=href,frame=src,form=,fieldset= user_agent => no value => no value tokenizer Tokenizer Support => enabled xml XML Support => active XML Namespace Support => active libxml2 Version => 2.9.3 xmlreader XMLReader => enabled xmlrpc core library version => xmlrpc-epi v. 0.51 php extension version => 0.51 author => Dan Libby homepage => http://xmlrpc-epi.sourceforge.net open sourced by => Epinions.com xmlwriter XMLWriter => enabled xsl XSL => enabled libxslt Version => 1.1.28 libxslt compiled against libxml Version => 2.9.3 EXSLT => enabled libexslt Version => 1.1.28 zip Zip => enabled Zip version => 1.12.5 Libzip version => 0.11.2 zlib ZLib Support => enabled Stream Wrapper => compress.zlib:// Stream Filter => zlib.inflate, zlib.deflate Compiled Version => 1.2.8 Linked Version => 1.2.8 Directive => Local Value => Master Value zlib.output_compression => Off => Off zlib.output_compression_level => -1 => -1 zlib.output_handler => no value => no value Additional Modules Module Name Environment Variable => Value XDG_VTNR => 2 GRAILS_HOME => /home/rbon/Applications/grails LC_PAPER => en_CA.utf8 XDG_SESSION_ID => 3 TOMCAT_HOME => /home/rbon/Applications/tomcat HOSTNAME => localhost.localdomainq LC_MONETARY => en_CA.utf8 TEST_PHP_SRCDIR => /home/rbon/Downloads/temp/php-5.6.30 GIO_LAUNCHED_DESKTOP_FILE_PID => 3291 WAYLAND_DISPLAY => wayland-0 SHELL => /bin/bash XDG_MENU_PREFIX => gnome- TERM => xterm MAKEFLAGS => HISTSIZE => 1000 SSH_CLIENT => deleted GRADLE_HOME => /home/rbon/Applications/gradle LC_NUMERIC => en_CA.utf8 QTDIR => /usr/lib64/qt-3.3 QTINC => /usr/lib64/qt-3.3/include SSH_TTY => deleted USER => rbon LS_COLORS => rs=0:di=01;34:ln=01;36:mh=00:pi=40;33:so=01;35:do=01;35:bd=40;33;01:cd=40;33;01:or=40;31;01:mi=01;05;37;41:su=37;41:sg=30;43:ca=30;41:tw=30;42:ow=34;42:st=37;44:ex=01;32:*.tar=01;31:*.tgz=01;31:*.arc=01;31:*.arj=01;31:*.taz=01;31:*.lha=01;31:*.lz4=01;31:*.lzh=01;31:*.lzma=01;31:*.tlz=01;31:*.txz=01;31:*.tzo=01;31:*.t7z=01;31:*.zip=01;31:*.z=01;31:*.Z=01;31:*.dz=01;31:*.gz=01;31:*.lrz=01;31:*.lz=01;31:*.lzo=01;31:*.xz=01;31:*.bz2=01;31:*.bz=01;31:*.tbz=01;31:*.tbz2=01;31:*.tz=01;31:*.deb=01;31:*.rpm=01;31:*.jar=01;31:*.war=01;31:*.ear=01;31:*.sar=01;31:*.rar=01;31:*.alz=01;31:*.ace=01;31:*.zoo=01;31:*.cpio=01;31:*.7z=01;31:*.rz=01;31:*.cab=01;31:*.jpg=01;35:*.jpeg=01;35:*.gif=01;35:*.bmp=01;35:*.pbm=01;35:*.pgm=01;35:*.ppm=01;35:*.tga=01;35:*.xbm=01;35:*.xpm=01;35:*.tif=01;35:*.tiff=01;35:*.png=01;35:*.svg=01;35:*.svgz=01;35:*.mng=01;35:*.pcx=01;35:*.mov=01;35:*.mpg=01;35:*.mpeg=01;35:*.m2v=01;35:*.mkv=01;35:*.webm=01;35:*.ogm=01;35:*.mp4=01;35:*.m4v=01;35:*.mp4v=01;35:*.vob=01;35:*.qt=01;35:*.nuv=01;35:*.wmv=01;35:*.asf=01;35:*.rm=01;35:*.rmvb=01;35:*.flc=01;35:*.avi=01;35:*.fli=01;35:*.flv=01;35:*.gl=01;35:*.dl=01;35:*.xcf=01;35:*.xwd=01;35:*.yuv=01;35:*.cgm=01;35:*.emf=01;35:*.ogv=01;35:*.ogx=01;35:*.aac=01;36:*.au=01;36:*.flac=01;36:*.m4a=01;36:*.mid=01;36:*.midi=01;36:*.mka=01;36:*.mp3=01;36:*.mpc=01;36:*.ogg=01;36:*.ra=01;36:*.wav=01;36:*.oga=01;36:*.opus=01;36:*.spx=01;36:*.xspf=01;36: LD_LIBRARY_PATH => /home/rbon/.local/lib:/home/rbon/.local/lib:/usr/lib/oracle/11.2/client64/lib::/usr/lib/oracle/11.2/client64/lib:/usr/lib/oracle/11.2/client64/lib DESKTOP_AUTOSTART_ID => 1073dfdbb2e64212cb148579720034654600000029020002 MAKE_TERMOUT => /dev/pts/8 SSH_AUTH_SOCK => deleted USERNAME => rbon SESSION_MANAGER => local/unix:@/tmp/.ICE-unix/2902,unix/unix:/tmp/.ICE-unix/2902 MAKELEVEL => 1 GIO_LAUNCHED_DESKTOP_FILE => /home/rbon/.config/autostart/guake.desktop MFLAGS => DESKTOP_SESSION => gnome PATH => .:/home/rbon/bin:/usr/lib64/qt-3.3/bin:/usr/local/bin:/usr/local/sbin:/usr/bin:/usr/sbin:/usr/lib/oracle/12.1/client64/bin:/home/rbon/Applications/grails/bin:/home/rbon/Applications/gradle/bin TNS_ADMIN => /home/rbon/.oracle MAIL => /var/spool/mail/rbon _ => /home/rbon/Downloads/temp/php-5.6.30/sapi/cli/php QT_QPA_PLATFORMTHEME => qgnomeplatform QT_IM_MODULE => ibus XDG_SESSION_TYPE => wayland PWD => /home/rbon/Downloads/temp/php-5.6.30 XMODIFIERS => @im=ibus JAVA_HOME => /usr/java/default EDITOR => vi LANG => en_CA.UTF-8 TEST_PHP_EXECUTABLE => /home/rbon/Downloads/temp/php-5.6.30/sapi/cli/php MODULEPATH => /etc/scl/modulefiles:/etc/scl/modulefiles:/usr/share/Modules/modulefiles:/etc/modulefiles:/usr/share/modulefiles GDM_LANG => en_CA.UTF-8 LOADEDMODULES => LC_MEASUREMENT => en_CA.utf8 SQLPATH => /home/rbon/.oracle GDMSESSION => gnome HISTIGNORE => pwd:ls:la:ll: HISTCONTROL => erasedups:ignoreboth SSH_ASKPASS => /usr/libexec/openssh/gnome-ssh-askpass HOME => /home/rbon XDG_SEAT => seat0 SHLVL => 4 GNOME_DESKTOP_SESSION_ID => this-is-deprecated XDG_SESSION_DESKTOP => gnome LOGNAME => rbon QTLIB => /usr/lib64/qt-3.3/lib CVS_RSH => ssh MAKE_TERMERR => /dev/pts/8 SSH_CONNECTION => deleted XDG_DATA_DIRS => /home/rbon/.local/share/flatpak/exports/share/:/var/lib/flatpak/exports/share/:/usr/local/share/:/usr/share/ DBUS_SESSION_BUS_ADDRESS => unix:path=/run/user/1000/bus MODULESHOME => /usr/share/Modules LESSOPEN => ||/usr/bin/lesspipe.sh %s JOURNAL_STREAM => 8:25497 SCALA_HOME => /home/rbon/Applications/scala GUAKE_TAB_UUID => a2df0b85-b75d-4038-a417-2126ad9233fb XDG_RUNTIME_DIR => /run/user/1000 DISPLAY => :0 CC => cc ORACLE_HOME => /usr/lib/oracle/11.2/client64 XDG_CURRENT_DESKTOP => GNOME LC_TIME => en_CA.utf8 BASH_FUNC_module() => () { eval `/usr/bin/modulecmd bash $*` } BASH_FUNC_scl() => () { local CMD=$1; if [ "$CMD" = "load" -o "$CMD" = "unload" ]; then eval "module $@"; else /usr/bin/scl "$@"; fi } PHP Variables Variable => Value _SERVER["XDG_VTNR"] => 2 _SERVER["GRAILS_HOME"] => /home/rbon/Applications/grails _SERVER["LC_PAPER"] => en_CA.utf8 _SERVER["XDG_SESSION_ID"] => 3 _SERVER["TOMCAT_HOME"] => /home/rbon/Applications/tomcat _SERVER["HOSTNAME"] => localhost.localdomainq _SERVER["LC_MONETARY"] => en_CA.utf8 _SERVER["TEST_PHP_SRCDIR"] => /home/rbon/Downloads/temp/php-5.6.30 _SERVER["GIO_LAUNCHED_DESKTOP_FILE_PID"] => 3291 _SERVER["WAYLAND_DISPLAY"] => wayland-0 _SERVER["SHELL"] => /bin/bash _SERVER["XDG_MENU_PREFIX"] => gnome- _SERVER["TERM"] => xterm _SERVER["MAKEFLAGS"] => _SERVER["HISTSIZE"] => 1000 _SERVER["SSH_CLIENT"] => deleted _SERVER["GRADLE_HOME"] => /home/rbon/Applications/gradle _SERVER["LC_NUMERIC"] => en_CA.utf8 _SERVER["QTDIR"] => /usr/lib64/qt-3.3 _SERVER["QTINC"] => /usr/lib64/qt-3.3/include _SERVER["SSH_TTY"] => deleted _SERVER["USER"] => rbon _SERVER["LS_COLORS"] => rs=0:di=01;34:ln=01;36:mh=00:pi=40;33:so=01;35:do=01;35:bd=40;33;01:cd=40;33;01:or=40;31;01:mi=01;05;37;41:su=37;41:sg=30;43:ca=30;41:tw=30;42:ow=34;42:st=37;44:ex=01;32:*.tar=01;31:*.tgz=01;31:*.arc=01;31:*.arj=01;31:*.taz=01;31:*.lha=01;31:*.lz4=01;31:*.lzh=01;31:*.lzma=01;31:*.tlz=01;31:*.txz=01;31:*.tzo=01;31:*.t7z=01;31:*.zip=01;31:*.z=01;31:*.Z=01;31:*.dz=01;31:*.gz=01;31:*.lrz=01;31:*.lz=01;31:*.lzo=01;31:*.xz=01;31:*.bz2=01;31:*.bz=01;31:*.tbz=01;31:*.tbz2=01;31:*.tz=01;31:*.deb=01;31:*.rpm=01;31:*.jar=01;31:*.war=01;31:*.ear=01;31:*.sar=01;31:*.rar=01;31:*.alz=01;31:*.ace=01;31:*.zoo=01;31:*.cpio=01;31:*.7z=01;31:*.rz=01;31:*.cab=01;31:*.jpg=01;35:*.jpeg=01;35:*.gif=01;35:*.bmp=01;35:*.pbm=01;35:*.pgm=01;35:*.ppm=01;35:*.tga=01;35:*.xbm=01;35:*.xpm=01;35:*.tif=01;35:*.tiff=01;35:*.png=01;35:*.svg=01;35:*.svgz=01;35:*.mng=01;35:*.pcx=01;35:*.mov=01;35:*.mpg=01;35:*.mpeg=01;35:*.m2v=01;35:*.mkv=01;35:*.webm=01;35:*.ogm=01;35:*.mp4=01;35:*.m4v=01;35:*.mp4v=01;35:*.vob=01;35:*.qt=01;35:*.nuv=01;35:*.wmv=01;35:*.asf=01;35:*.rm=01;35:*.rmvb=01;35:*.flc=01;35:*.avi=01;35:*.fli=01;35:*.flv=01;35:*.gl=01;35:*.dl=01;35:*.xcf=01;35:*.xwd=01;35:*.yuv=01;35:*.cgm=01;35:*.emf=01;35:*.ogv=01;35:*.ogx=01;35:*.aac=01;36:*.au=01;36:*.flac=01;36:*.m4a=01;36:*.mid=01;36:*.midi=01;36:*.mka=01;36:*.mp3=01;36:*.mpc=01;36:*.ogg=01;36:*.ra=01;36:*.wav=01;36:*.oga=01;36:*.opus=01;36:*.spx=01;36:*.xspf=01;36: _SERVER["LD_LIBRARY_PATH"] => /home/rbon/.local/lib:/home/rbon/.local/lib:/usr/lib/oracle/11.2/client64/lib::/usr/lib/oracle/11.2/client64/lib:/usr/lib/oracle/11.2/client64/lib _SERVER["DESKTOP_AUTOSTART_ID"] => 1073dfdbb2e64212cb148579720034654600000029020002 _SERVER["MAKE_TERMOUT"] => /dev/pts/8 _SERVER["SSH_AUTH_SOCK"] => deleted _SERVER["USERNAME"] => rbon _SERVER["SESSION_MANAGER"] => local/unix:@/tmp/.ICE-unix/2902,unix/unix:/tmp/.ICE-unix/2902 _SERVER["MAKELEVEL"] => 1 _SERVER["GIO_LAUNCHED_DESKTOP_FILE"] => /home/rbon/.config/autostart/guake.desktop _SERVER["MFLAGS"] => _SERVER["DESKTOP_SESSION"] => gnome _SERVER["PATH"] => .:/home/rbon/bin:/usr/lib64/qt-3.3/bin:/usr/local/bin:/usr/local/sbin:/usr/bin:/usr/sbin:/usr/lib/oracle/12.1/client64/bin:/home/rbon/Applications/grails/bin:/home/rbon/Applications/gradle/bin _SERVER["TNS_ADMIN"] => /home/rbon/.oracle _SERVER["MAIL"] => /var/spool/mail/rbon _SERVER["_"] => /home/rbon/Downloads/temp/php-5.6.30/sapi/cli/php _SERVER["QT_QPA_PLATFORMTHEME"] => qgnomeplatform _SERVER["QT_IM_MODULE"] => ibus _SERVER["XDG_SESSION_TYPE"] => wayland _SERVER["PWD"] => /home/rbon/Downloads/temp/php-5.6.30 _SERVER["XMODIFIERS"] => @im=ibus _SERVER["JAVA_HOME"] => /usr/java/default _SERVER["EDITOR"] => vi _SERVER["LANG"] => en_CA.UTF-8 _SERVER["TEST_PHP_EXECUTABLE"] => /home/rbon/Downloads/temp/php-5.6.30/sapi/cli/php _SERVER["MODULEPATH"] => /etc/scl/modulefiles:/etc/scl/modulefiles:/usr/share/Modules/modulefiles:/etc/modulefiles:/usr/share/modulefiles _SERVER["GDM_LANG"] => en_CA.UTF-8 _SERVER["LOADEDMODULES"] => _SERVER["LC_MEASUREMENT"] => en_CA.utf8 _SERVER["SQLPATH"] => /home/rbon/.oracle _SERVER["GDMSESSION"] => gnome _SERVER["HISTIGNORE"] => pwd:ls:la:ll: _SERVER["HISTCONTROL"] => erasedups:ignoreboth _SERVER["SSH_ASKPASS"] => /usr/libexec/openssh/gnome-ssh-askpass _SERVER["HOME"] => /home/rbon _SERVER["XDG_SEAT"] => seat0 _SERVER["SHLVL"] => 4 _SERVER["GNOME_DESKTOP_SESSION_ID"] => this-is-deprecated _SERVER["XDG_SESSION_DESKTOP"] => gnome _SERVER["LOGNAME"] => rbon _SERVER["QTLIB"] => /usr/lib64/qt-3.3/lib _SERVER["CVS_RSH"] => ssh _SERVER["MAKE_TERMERR"] => /dev/pts/8 _SERVER["SSH_CONNECTION"] => deleted _SERVER["XDG_DATA_DIRS"] => /home/rbon/.local/share/flatpak/exports/share/:/var/lib/flatpak/exports/share/:/usr/local/share/:/usr/share/ _SERVER["DBUS_SESSION_BUS_ADDRESS"] => unix:path=/run/user/1000/bus _SERVER["MODULESHOME"] => /usr/share/Modules _SERVER["LESSOPEN"] => ||/usr/bin/lesspipe.sh %s _SERVER["JOURNAL_STREAM"] => 8:25497 _SERVER["SCALA_HOME"] => /home/rbon/Applications/scala _SERVER["GUAKE_TAB_UUID"] => a2df0b85-b75d-4038-a417-2126ad9233fb _SERVER["XDG_RUNTIME_DIR"] => /run/user/1000 _SERVER["DISPLAY"] => :0 _SERVER["CC"] => cc _SERVER["ORACLE_HOME"] => /usr/lib/oracle/11.2/client64 _SERVER["XDG_CURRENT_DESKTOP"] => GNOME _SERVER["LC_TIME"] => en_CA.utf8 _SERVER["BASH_FUNC_module()"] => () { eval `/usr/bin/modulecmd bash $*` } _SERVER["BASH_FUNC_scl()"] => () { local CMD=$1; if [ "$CMD" = "load" -o "$CMD" = "unload" ]; then eval "module $@"; else /usr/bin/scl "$@"; fi } _SERVER["PHP_SELF"] => _SERVER["SCRIPT_NAME"] => _SERVER["SCRIPT_FILENAME"] => _SERVER["PATH_TRANSLATED"] => _SERVER["DOCUMENT_ROOT"] => _SERVER["REQUEST_TIME_FLOAT"] => 1486161212.3457 _SERVER["REQUEST_TIME"] => 1486161212 _SERVER["argv"] => Array ( ) _SERVER["argc"] => 0 _ENV["XDG_VTNR"] => 2 _ENV["GRAILS_HOME"] => /home/rbon/Applications/grails _ENV["LC_PAPER"] => en_CA.utf8 _ENV["XDG_SESSION_ID"] => 3 _ENV["TOMCAT_HOME"] => /home/rbon/Applications/tomcat _ENV["HOSTNAME"] => localhost.localdomainq _ENV["LC_MONETARY"] => en_CA.utf8 _ENV["TEST_PHP_SRCDIR"] => /home/rbon/Downloads/temp/php-5.6.30 _ENV["GIO_LAUNCHED_DESKTOP_FILE_PID"] => 3291 _ENV["WAYLAND_DISPLAY"] => wayland-0 _ENV["SHELL"] => /bin/bash _ENV["XDG_MENU_PREFIX"] => gnome- _ENV["TERM"] => xterm _ENV["MAKEFLAGS"] => _ENV["HISTSIZE"] => 1000 _ENV["SSH_CLIENT"] => deleted _ENV["GRADLE_HOME"] => /home/rbon/Applications/gradle _ENV["LC_NUMERIC"] => en_CA.utf8 _ENV["QTDIR"] => /usr/lib64/qt-3.3 _ENV["QTINC"] => /usr/lib64/qt-3.3/include _ENV["SSH_TTY"] => deleted _ENV["USER"] => rbon _ENV["LS_COLORS"] => rs=0:di=01;34:ln=01;36:mh=00:pi=40;33:so=01;35:do=01;35:bd=40;33;01:cd=40;33;01:or=40;31;01:mi=01;05;37;41:su=37;41:sg=30;43:ca=30;41:tw=30;42:ow=34;42:st=37;44:ex=01;32:*.tar=01;31:*.tgz=01;31:*.arc=01;31:*.arj=01;31:*.taz=01;31:*.lha=01;31:*.lz4=01;31:*.lzh=01;31:*.lzma=01;31:*.tlz=01;31:*.txz=01;31:*.tzo=01;31:*.t7z=01;31:*.zip=01;31:*.z=01;31:*.Z=01;31:*.dz=01;31:*.gz=01;31:*.lrz=01;31:*.lz=01;31:*.lzo=01;31:*.xz=01;31:*.bz2=01;31:*.bz=01;31:*.tbz=01;31:*.tbz2=01;31:*.tz=01;31:*.deb=01;31:*.rpm=01;31:*.jar=01;31:*.war=01;31:*.ear=01;31:*.sar=01;31:*.rar=01;31:*.alz=01;31:*.ace=01;31:*.zoo=01;31:*.cpio=01;31:*.7z=01;31:*.rz=01;31:*.cab=01;31:*.jpg=01;35:*.jpeg=01;35:*.gif=01;35:*.bmp=01;35:*.pbm=01;35:*.pgm=01;35:*.ppm=01;35:*.tga=01;35:*.xbm=01;35:*.xpm=01;35:*.tif=01;35:*.tiff=01;35:*.png=01;35:*.svg=01;35:*.svgz=01;35:*.mng=01;35:*.pcx=01;35:*.mov=01;35:*.mpg=01;35:*.mpeg=01;35:*.m2v=01;35:*.mkv=01;35:*.webm=01;35:*.ogm=01;35:*.mp4=01;35:*.m4v=01;35:*.mp4v=01;35:*.vob=01;35:*.qt=01;35:*.nuv=01;35:*.wmv=01;35:*.asf=01;35:*.rm=01;35:*.rmvb=01;35:*.flc=01;35:*.avi=01;35:*.fli=01;35:*.flv=01;35:*.gl=01;35:*.dl=01;35:*.xcf=01;35:*.xwd=01;35:*.yuv=01;35:*.cgm=01;35:*.emf=01;35:*.ogv=01;35:*.ogx=01;35:*.aac=01;36:*.au=01;36:*.flac=01;36:*.m4a=01;36:*.mid=01;36:*.midi=01;36:*.mka=01;36:*.mp3=01;36:*.mpc=01;36:*.ogg=01;36:*.ra=01;36:*.wav=01;36:*.oga=01;36:*.opus=01;36:*.spx=01;36:*.xspf=01;36: _ENV["LD_LIBRARY_PATH"] => /home/rbon/.local/lib:/home/rbon/.local/lib:/usr/lib/oracle/11.2/client64/lib::/usr/lib/oracle/11.2/client64/lib:/usr/lib/oracle/11.2/client64/lib _ENV["DESKTOP_AUTOSTART_ID"] => 1073dfdbb2e64212cb148579720034654600000029020002 _ENV["MAKE_TERMOUT"] => /dev/pts/8 _ENV["SSH_AUTH_SOCK"] => deleted _ENV["USERNAME"] => rbon _ENV["SESSION_MANAGER"] => local/unix:@/tmp/.ICE-unix/2902,unix/unix:/tmp/.ICE-unix/2902 _ENV["MAKELEVEL"] => 1 _ENV["GIO_LAUNCHED_DESKTOP_FILE"] => /home/rbon/.config/autostart/guake.desktop _ENV["MFLAGS"] => _ENV["DESKTOP_SESSION"] => gnome _ENV["PATH"] => .:/home/rbon/bin:/usr/lib64/qt-3.3/bin:/usr/local/bin:/usr/local/sbin:/usr/bin:/usr/sbin:/usr/lib/oracle/12.1/client64/bin:/home/rbon/Applications/grails/bin:/home/rbon/Applications/gradle/bin _ENV["TNS_ADMIN"] => /home/rbon/.oracle _ENV["MAIL"] => /var/spool/mail/rbon _ENV["_"] => /home/rbon/Downloads/temp/php-5.6.30/sapi/cli/php _ENV["QT_QPA_PLATFORMTHEME"] => qgnomeplatform _ENV["QT_IM_MODULE"] => ibus _ENV["XDG_SESSION_TYPE"] => wayland _ENV["PWD"] => /home/rbon/Downloads/temp/php-5.6.30 _ENV["XMODIFIERS"] => @im=ibus _ENV["JAVA_HOME"] => /usr/java/default _ENV["EDITOR"] => vi _ENV["LANG"] => en_CA.UTF-8 _ENV["TEST_PHP_EXECUTABLE"] => /home/rbon/Downloads/temp/php-5.6.30/sapi/cli/php _ENV["MODULEPATH"] => /etc/scl/modulefiles:/etc/scl/modulefiles:/usr/share/Modules/modulefiles:/etc/modulefiles:/usr/share/modulefiles _ENV["GDM_LANG"] => en_CA.UTF-8 _ENV["LOADEDMODULES"] => _ENV["LC_MEASUREMENT"] => en_CA.utf8 _ENV["SQLPATH"] => /home/rbon/.oracle _ENV["GDMSESSION"] => gnome _ENV["HISTIGNORE"] => pwd:ls:la:ll: _ENV["HISTCONTROL"] => erasedups:ignoreboth _ENV["SSH_ASKPASS"] => /usr/libexec/openssh/gnome-ssh-askpass _ENV["HOME"] => /home/rbon _ENV["XDG_SEAT"] => seat0 _ENV["SHLVL"] => 4 _ENV["GNOME_DESKTOP_SESSION_ID"] => this-is-deprecated _ENV["XDG_SESSION_DESKTOP"] => gnome _ENV["LOGNAME"] => rbon _ENV["QTLIB"] => /usr/lib64/qt-3.3/lib _ENV["CVS_RSH"] => ssh _ENV["MAKE_TERMERR"] => /dev/pts/8 _ENV["SSH_CONNECTION"] => deleted _ENV["XDG_DATA_DIRS"] => /home/rbon/.local/share/flatpak/exports/share/:/var/lib/flatpak/exports/share/:/usr/local/share/:/usr/share/ _ENV["DBUS_SESSION_BUS_ADDRESS"] => unix:path=/run/user/1000/bus _ENV["MODULESHOME"] => /usr/share/Modules _ENV["LESSOPEN"] => ||/usr/bin/lesspipe.sh %s _ENV["JOURNAL_STREAM"] => 8:25497 _ENV["SCALA_HOME"] => /home/rbon/Applications/scala _ENV["GUAKE_TAB_UUID"] => a2df0b85-b75d-4038-a417-2126ad9233fb _ENV["XDG_RUNTIME_DIR"] => /run/user/1000 _ENV["DISPLAY"] => :0 _ENV["CC"] => cc _ENV["ORACLE_HOME"] => /usr/lib/oracle/11.2/client64 _ENV["XDG_CURRENT_DESKTOP"] => GNOME _ENV["LC_TIME"] => en_CA.utf8 _ENV["BASH_FUNC_module()"] => () { eval `/usr/bin/modulecmd bash $*` } _ENV["BASH_FUNC_scl()"] => () { local CMD=$1; if [ "$CMD" = "load" -o "$CMD" = "unload" ]; then eval "module $@"; else /usr/bin/scl "$@"; fi } PHP License This program is free software; you can redistribute it and/or modify it under the terms of the PHP License as published by the PHP Group and included in the distribution in the file: LICENSE This program is distributed in the hope that it will be useful, but WITHOUT ANY WARRANTY; without even the implied warranty of MERCHANTABILITY or FITNESS FOR A PARTICULAR PURPOSE. If you did not receive a copy of the PHP license, or have any questions about PHP licensing, please contact license@php.net.
===================================================================== EXPECTED FAILED TEST SUMMARY --------------------------------------------------------------------- Test open_basedir configuration [tests/security/open_basedir_linkinfo.phpt] XFAIL REASON: BUG: open_basedir cannot delete symlink to prohibited file. See also bugs 48111 and 52176. Inconsistencies when accessing protected members [Zend/tests/access_modifiers_008.phpt] XFAIL REASON: Discussion: http://marc.info/?l=php-internals&m=120221184420957&w=2 Inconsistencies when accessing protected members - 2 [Zend/tests/access_modifiers_009.phpt] XFAIL REASON: Discussion: http://marc.info/?l=php-internals&m=120221184420957&w=2 Bug #48770 (call_user_func_array() fails to call parent from inheriting class) [Zend/tests/bug48770.phpt] XFAIL REASON: See Bug #48770 Bug #48770 (call_user_func_array() fails to call parent from inheriting class) [Zend/tests/bug48770_2.phpt] XFAIL REASON: See Bug #48770 Bug #48770 (call_user_func_array() fails to call parent from inheriting class) [Zend/tests/bug48770_3.phpt] XFAIL REASON: See Bug #48770 Bug #64896 (Segfault with gc_collect_cycles using unserialize on certain objects) [Zend/tests/bug64896.phpt] XFAIL REASON: We can not fix this bug without a significant (performace slow down) change to gc Initial value of static var in method depends on the include time of the class definition [Zend/tests/method_static_var.phpt] XFAIL REASON: Maybe not a bug DateTime::add() -- fall type2 type3 [ext/date/tests/DateTime_add-fall-type2-type3.phpt] XFAIL REASON: Various bugs exist DateTime::add() -- fall type3 type2 [ext/date/tests/DateTime_add-fall-type3-type2.phpt] XFAIL REASON: Various bugs exist DateTime::add() -- fall type3 type3 [ext/date/tests/DateTime_add-fall-type3-type3.phpt] XFAIL REASON: Various bugs exist DateTime::add() -- spring type2 type3 [ext/date/tests/DateTime_add-spring-type2-type3.phpt] XFAIL REASON: Various bugs exist DateTime::add() -- spring type3 type2 [ext/date/tests/DateTime_add-spring-type3-type2.phpt] XFAIL REASON: Various bugs exist DateTime::add() -- spring type3 type3 [ext/date/tests/DateTime_add-spring-type3-type3.phpt] XFAIL REASON: Various bugs exist DateTime::diff() -- fall type2 type3 [ext/date/tests/DateTime_diff-fall-type2-type3.phpt] XFAIL REASON: Various bugs exist DateTime::diff() -- fall type3 type2 [ext/date/tests/DateTime_diff-fall-type3-type2.phpt] XFAIL REASON: Various bugs exist DateTime::diff() -- fall type3 type3 [ext/date/tests/DateTime_diff-fall-type3-type3.phpt] XFAIL REASON: Various bugs exist DateTime::diff() -- spring type2 type3 [ext/date/tests/DateTime_diff-spring-type2-type3.phpt] XFAIL REASON: Various bugs exist DateTime::diff() -- spring type3 type2 [ext/date/tests/DateTime_diff-spring-type3-type2.phpt] XFAIL REASON: Various bugs exist DateTime::diff() -- spring type3 type3 [ext/date/tests/DateTime_diff-spring-type3-type3.phpt] XFAIL REASON: Various bugs exist DateTime::sub() -- fall type2 type3 [ext/date/tests/DateTime_sub-fall-type2-type3.phpt] XFAIL REASON: Various bugs exist DateTime::sub() -- fall type3 type2 [ext/date/tests/DateTime_sub-fall-type3-type2.phpt] XFAIL REASON: Various bugs exist DateTime::sub() -- fall type3 type3 [ext/date/tests/DateTime_sub-fall-type3-type3.phpt] XFAIL REASON: Various bugs exist DateTime::sub() -- spring type2 type3 [ext/date/tests/DateTime_sub-spring-type2-type3.phpt] XFAIL REASON: Various bugs exist DateTime::sub() -- spring type3 type2 [ext/date/tests/DateTime_sub-spring-type3-type2.phpt] XFAIL REASON: Various bugs exist DateTime::sub() -- spring type3 type3 [ext/date/tests/DateTime_sub-spring-type3-type3.phpt] XFAIL REASON: Various bugs exist RFC: DateTime and Daylight Saving Time Transitions (zone type 3, bd2) [ext/date/tests/rfc-datetime_and_daylight_saving_time-type3-bd2.phpt] XFAIL REASON: Still not quite right RFC: DateTime and Daylight Saving Time Transitions (zone type 3, fs) [ext/date/tests/rfc-datetime_and_daylight_saving_time-type3-fs.phpt] XFAIL REASON: Still not quite right Bug #42718 (unsafe_raw filter not applied when configured as default filter) [ext/filter/tests/bug42718.phpt] XFAIL REASON: FILTER_UNSAFE_RAW not applied when configured as default filter, even with flags Bug #67296 (filter_input doesn't validate variables) [ext/filter/tests/bug49184.phpt] XFAIL REASON: See Bug #49184 Bug #67167: filter_var(null,FILTER_VALIDATE_BOOLEAN,FILTER_NULL_ON_FAILURE) returns null [ext/filter/tests/bug67167.02.phpt] XFAIL REASON: Requires php_zval_filter to not use convert_to_string for all filters. zend multibyte (7) [ext/mbstring/tests/zend_multibyte-07.phpt] XFAIL REASON: https://bugs.php.net/bug.php?id=66582 zend multibyte (9) [ext/mbstring/tests/zend_multibyte-09.phpt] XFAIL REASON: https://bugs.php.net/bug.php?id=66582 Bug #70470 (Built-in server truncates headers spanning over TCP packets) [sapi/cli/tests/bug70470.phpt] XFAIL REASON: bug is not fixed yet ===================================================================== ===================================================================== FAILED TEST SUMMARY --------------------------------------------------------------------- Bug #54268 (Double free when destroy_zend_class fails) [Zend/tests/bug54268.phpt] Bug #5547 (mysql_pconnect leaks file descriptors on reconnect) [ext/mysql/tests/bug55473.phpt] mysql_field_flags() [ext/mysql/tests/mysql_field_flags.phpt] LOAD DATA INFILE - open_basedir [ext/mysql/tests/mysql_query_load_data_openbasedir.phpt] file_get_contents() test using offset parameter out of range [ext/standard/tests/file/file_get_contents_error001.phpt] Test lstat() and stat() functions: usage variations - effects of is_dir() [ext/standard/tests/file/lstat_stat_variation10.phpt] ===================================================================== ===================================================================== WARNED TEST SUMMARY --------------------------------------------------------------------- zend multibyte (2) [ext/mbstring/tests/zend_multibyte-02.phpt] (warn: XFAIL section but test passes) zend multibyte (6) [ext/mbstring/tests/zend_multibyte-06.phpt] (warn: XFAIL section but test passes) zend multibyte (8) [ext/mbstring/tests/zend_multibyte-08.phpt] (warn: XFAIL section but test passes) zend multibyte (10) [ext/mbstring/tests/zend_multibyte-10.phpt] (warn: XFAIL section but test passes) zend multibyte (11) [ext/mbstring/tests/zend_multibyte-11.phpt] (warn: XFAIL section but test passes) Phar: bug #69958: Segfault in Phar::convertToData on invalid file [ext/phar/tests/bug69958.phpt] (warn: XFAIL section but test passes) Bug #69111 Crash in SessionHandler::read() [ext/session/tests/bug69111.phpt] (warn: XFAIL section but test passes) Bug #70172 - Use After Free Vulnerability in unserialize() [ext/standard/tests/serialize/bug70172.phpt] (warn: XFAIL section but test passes) Bug #72663: Create an Unexpected Object and Don't Invoke __wakeup() in Deserialization [ext/standard/tests/strings/bug72663_3.phpt] (warn: XFAIL section but test passes) ===================================================================== ===================================================================== TEST RESULT SUMMARY --------------------------------------------------------------------- Exts skipped : 38 Exts tested : 42 --------------------------------------------------------------------- Number of tests : 13920 11347 Tests skipped : 2573 ( 18.5%) -------- Tests warned : 9 ( 0.1%) ( 0.1%) Tests failed : 6 ( 0.0%) ( 0.1%) Expected fail : 34 ( 0.2%) ( 0.3%) Tests passed : 11298 ( 81.2%) ( 99.6%) --------------------------------------------------------------------- Time taken : 1405 seconds ===================================================================== ===================================================================== EXPECTED FAILED TEST SUMMARY --------------------------------------------------------------------- Test open_basedir configuration [tests/security/open_basedir_linkinfo.phpt] XFAIL REASON: BUG: open_basedir cannot delete symlink to prohibited file. See also bugs 48111 and 52176. Inconsistencies when accessing protected members [Zend/tests/access_modifiers_008.phpt] XFAIL REASON: Discussion: http://marc.info/?l=php-internals&m=120221184420957&w=2 Inconsistencies when accessing protected members - 2 [Zend/tests/access_modifiers_009.phpt] XFAIL REASON: Discussion: http://marc.info/?l=php-internals&m=120221184420957&w=2 Bug #48770 (call_user_func_array() fails to call parent from inheriting class) [Zend/tests/bug48770.phpt] XFAIL REASON: See Bug #48770 Bug #48770 (call_user_func_array() fails to call parent from inheriting class) [Zend/tests/bug48770_2.phpt] XFAIL REASON: See Bug #48770 Bug #48770 (call_user_func_array() fails to call parent from inheriting class) [Zend/tests/bug48770_3.phpt] XFAIL REASON: See Bug #48770 Bug #64896 (Segfault with gc_collect_cycles using unserialize on certain objects) [Zend/tests/bug64896.phpt] XFAIL REASON: We can not fix this bug without a significant (performace slow down) change to gc Initial value of static var in method depends on the include time of the class definition [Zend/tests/method_static_var.phpt] XFAIL REASON: Maybe not a bug DateTime::add() -- fall type2 type3 [ext/date/tests/DateTime_add-fall-type2-type3.phpt] XFAIL REASON: Various bugs exist DateTime::add() -- fall type3 type2 [ext/date/tests/DateTime_add-fall-type3-type2.phpt] XFAIL REASON: Various bugs exist DateTime::add() -- fall type3 type3 [ext/date/tests/DateTime_add-fall-type3-type3.phpt] XFAIL REASON: Various bugs exist DateTime::add() -- spring type2 type3 [ext/date/tests/DateTime_add-spring-type2-type3.phpt] XFAIL REASON: Various bugs exist DateTime::add() -- spring type3 type2 [ext/date/tests/DateTime_add-spring-type3-type2.phpt] XFAIL REASON: Various bugs exist DateTime::add() -- spring type3 type3 [ext/date/tests/DateTime_add-spring-type3-type3.phpt] XFAIL REASON: Various bugs exist DateTime::diff() -- fall type2 type3 [ext/date/tests/DateTime_diff-fall-type2-type3.phpt] XFAIL REASON: Various bugs exist DateTime::diff() -- fall type3 type2 [ext/date/tests/DateTime_diff-fall-type3-type2.phpt] XFAIL REASON: Various bugs exist DateTime::diff() -- fall type3 type3 [ext/date/tests/DateTime_diff-fall-type3-type3.phpt] XFAIL REASON: Various bugs exist DateTime::diff() -- spring type2 type3 [ext/date/tests/DateTime_diff-spring-type2-type3.phpt] XFAIL REASON: Various bugs exist DateTime::diff() -- spring type3 type2 [ext/date/tests/DateTime_diff-spring-type3-type2.phpt] XFAIL REASON: Various bugs exist DateTime::diff() -- spring type3 type3 [ext/date/tests/DateTime_diff-spring-type3-type3.phpt] XFAIL REASON: Various bugs exist DateTime::sub() -- fall type2 type3 [ext/date/tests/DateTime_sub-fall-type2-type3.phpt] XFAIL REASON: Various bugs exist DateTime::sub() -- fall type3 type2 [ext/date/tests/DateTime_sub-fall-type3-type2.phpt] XFAIL REASON: Various bugs exist DateTime::sub() -- fall type3 type3 [ext/date/tests/DateTime_sub-fall-type3-type3.phpt] XFAIL REASON: Various bugs exist DateTime::sub() -- spring type2 type3 [ext/date/tests/DateTime_sub-spring-type2-type3.phpt] XFAIL REASON: Various bugs exist DateTime::sub() -- spring type3 type2 [ext/date/tests/DateTime_sub-spring-type3-type2.phpt] XFAIL REASON: Various bugs exist DateTime::sub() -- spring type3 type3 [ext/date/tests/DateTime_sub-spring-type3-type3.phpt] XFAIL REASON: Various bugs exist RFC: DateTime and Daylight Saving Time Transitions (zone type 3, bd2) [ext/date/tests/rfc-datetime_and_daylight_saving_time-type3-bd2.phpt] XFAIL REASON: Still not quite right RFC: DateTime and Daylight Saving Time Transitions (zone type 3, fs) [ext/date/tests/rfc-datetime_and_daylight_saving_time-type3-fs.phpt] XFAIL REASON: Still not quite right Bug #42718 (unsafe_raw filter not applied when configured as default filter) [ext/filter/tests/bug42718.phpt] XFAIL REASON: FILTER_UNSAFE_RAW not applied when configured as default filter, even with flags Bug #67296 (filter_input doesn't validate variables) [ext/filter/tests/bug49184.phpt] XFAIL REASON: See Bug #49184 Bug #67167: filter_var(null,FILTER_VALIDATE_BOOLEAN,FILTER_NULL_ON_FAILURE) returns null [ext/filter/tests/bug67167.02.phpt] XFAIL REASON: Requires php_zval_filter to not use convert_to_string for all filters. zend multibyte (7) [ext/mbstring/tests/zend_multibyte-07.phpt] XFAIL REASON: https://bugs.php.net/bug.php?id=66582 zend multibyte (9) [ext/mbstring/tests/zend_multibyte-09.phpt] XFAIL REASON: https://bugs.php.net/bug.php?id=66582 Bug #70470 (Built-in server truncates headers spanning over TCP packets) [sapi/cli/tests/bug70470.phpt] XFAIL REASON: bug is not fixed yet ===================================================================== ===================================================================== FAILED TEST SUMMARY --------------------------------------------------------------------- Bug #54268 (Double free when destroy_zend_class fails) [Zend/tests/bug54268.phpt] Bug #5547 (mysql_pconnect leaks file descriptors on reconnect) [ext/mysql/tests/bug55473.phpt] mysql_field_flags() [ext/mysql/tests/mysql_field_flags.phpt] LOAD DATA INFILE - open_basedir [ext/mysql/tests/mysql_query_load_data_openbasedir.phpt] file_get_contents() test using offset parameter out of range [ext/standard/tests/file/file_get_contents_error001.phpt] Test lstat() and stat() functions: usage variations - effects of is_dir() [ext/standard/tests/file/lstat_stat_variation10.phpt] ===================================================================== ===================================================================== WARNED TEST SUMMARY --------------------------------------------------------------------- zend multibyte (2) [ext/mbstring/tests/zend_multibyte-02.phpt] (warn: XFAIL section but test passes) zend multibyte (6) [ext/mbstring/tests/zend_multibyte-06.phpt] (warn: XFAIL section but test passes) zend multibyte (8) [ext/mbstring/tests/zend_multibyte-08.phpt] (warn: XFAIL section but test passes) zend multibyte (10) [ext/mbstring/tests/zend_multibyte-10.phpt] (warn: XFAIL section but test passes) zend multibyte (11) [ext/mbstring/tests/zend_multibyte-11.phpt] (warn: XFAIL section but test passes) Phar: bug #69958: Segfault in Phar::convertToData on invalid file [ext/phar/tests/bug69958.phpt] (warn: XFAIL section but test passes) Bug #69111 Crash in SessionHandler::read() [ext/session/tests/bug69111.phpt] (warn: XFAIL section but test passes) Bug #70172 - Use After Free Vulnerability in unserialize() [ext/standard/tests/serialize/bug70172.phpt] (warn: XFAIL section but test passes) Bug #72663: Create an Unexpected Object and Don't Invoke __wakeup() in Deserialization [ext/standard/tests/strings/bug72663_3.phpt] (warn: XFAIL section but test passes) ===================================================================== ================================================================================ /home/rbon/Downloads/temp/php-5.6.30/Zend/tests/bug54268.phpt ================================================================================ ================================================================================ 001+ 001- Fatal error: Allowed memory size of %s bytes exhausted%s(tried to allocate %s bytes) in %s on line %d ================================================================================ ================================================================================ /home/rbon/Downloads/temp/php-5.6.30/ext/mysql/tests/bug55473.phpt ================================================================================ Deprecated: mysql_pconnect(): The mysql extension is deprecated and will be removed in the future: use mysqli or PDO instead in /home/rbon/Downloads/temp/php-5.6.30/ext/mysql/tests/bug55473.php on line 13 [003] reconnect 0 Deprecated: mysql_pconnect(): The mysql extension is deprecated and will be removed in the future: use mysqli or PDO instead in /home/rbon/Downloads/temp/php-5.6.30/ext/mysql/tests/bug55473.php on line 13 [005] Setting openened files... [003] reconnect 1 Deprecated: mysql_pconnect(): The mysql extension is deprecated and will be removed in the future: use mysqli or PDO instead in /home/rbon/Downloads/temp/php-5.6.30/ext/mysql/tests/bug55473.php on line 13 [007] Opened files as expected [003] reconnect 2 Deprecated: mysql_pconnect(): The mysql extension is deprecated and will be removed in the future: use mysqli or PDO instead in /home/rbon/Downloads/temp/php-5.6.30/ext/mysql/tests/bug55473.php on line 13 [007] Opened files as expected [003] reconnect 3 Deprecated: mysql_pconnect(): The mysql extension is deprecated and will be removed in the future: use mysqli or PDO instead in /home/rbon/Downloads/temp/php-5.6.30/ext/mysql/tests/bug55473.php on line 13 [007] Opened files as expected done! ================================================================================ 002- 003- Warning: mysql_ping(): MySQL server has gone away in %s on line %d 006+ [003] reconnect 1 008+ Deprecated: mysql_pconnect(): The mysql extension is deprecated and will be removed in the future: use mysqli or PDO instead in /home/rbon/Downloads/temp/php-5.6.30/ext/mysql/tests/bug55473.php on line 13 009+ [007] Opened files as expected 010+ [003] reconnect 2 011+ 012+ Deprecated: mysql_pconnect(): The mysql extension is deprecated and will be removed in the future: use mysqli or PDO instead in /home/rbon/Downloads/temp/php-5.6.30/ext/mysql/tests/bug55473.php on line 13 013+ [007] Opened files as expected 014+ [003] reconnect 3 009- Warning: mysql_ping(): MySQL server has gone away in %s on line %d 010- [003] reconnect 1 014- 018+ done! 015- Warning: mysql_ping(): MySQL server has gone away in %s on line %d 016- [003] reconnect 2 017- 018- Deprecated: mysql_pconnect(): The mysql extension is deprecated and will be removed in the future: use mysqli or PDO instead in %s on line %d 019- [007] Opened files as expected 020- 021- Warning: mysql_ping(): MySQL server has gone away in %s on line %d 022- [003] reconnect 3 023- 024- Deprecated: mysql_pconnect(): The mysql extension is deprecated and will be removed in the future: use mysqli or PDO instead in %s on line %d 025- [007] Opened files as expected 026- done! ================================================================================ ================================================================================ /home/rbon/Downloads/temp/php-5.6.30/ext/mysql/tests/mysql_field_flags.phpt ================================================================================ Deprecated: mysql_connect(): The mysql extension is deprecated and will be removed in the future: use mysqli or PDO instead in /home/rbon/Downloads/temp/php-5.6.30/ext/mysql/tests/connect.inc on line 37 Warning: mysql_field_flags() expects exactly 2 parameters, 1 given in /home/rbon/Downloads/temp/php-5.6.30/ext/mysql/tests/mysql_field_flags.php on line 18 Warning: mysql_field_flags(): Field -1 is invalid for MySQL result index 8 in /home/rbon/Downloads/temp/php-5.6.30/ext/mysql/tests/mysql_field_flags.php on line 21 Warning: mysql_field_flags(): Field 2 is invalid for MySQL result index 8 in /home/rbon/Downloads/temp/php-5.6.30/ext/mysql/tests/mysql_field_flags.php on line 32 [013/label1 TIMESTAMP] Field 'label1', flag 'zerofill' not found, [0] Warning: mysql_field_flags(): 15 is not a valid MySQL result resource in /home/rbon/Downloads/temp/php-5.6.30/ext/mysql/tests/mysql_field_flags.php on line 129 bool(false) done! ================================================================================ 008+ [013/label1 TIMESTAMP] Field 'label1', flag 'zerofill' not found, [0] ================================================================================ ================================================================================ /home/rbon/Downloads/temp/php-5.6.30/ext/mysql/tests/mysql_query_load_data_openbasedir.phpt ================================================================================ Deprecated: mysql_connect(): The mysql extension is deprecated and will be removed in the future: use mysqli or PDO instead in /home/rbon/Downloads/temp/php-5.6.30/ext/mysql/tests/connect.inc on line 37 Deprecated: mysql_connect(): The mysql extension is deprecated and will be removed in the future: use mysqli or PDO instead in /home/rbon/Downloads/temp/php-5.6.30/ext/mysql/tests/mysql_query_load_data_openbasedir.php on line 21 [010] [2000] open_basedir restriction in effect. Unable to open file done! ================================================================================ 004+ [010] [2000] open_basedir restriction in effect. Unable to open file 004- [006] [1148] %s 005- [007] [0] '' 006- [008] LOAD DATA not run? 007- [010] [1148] %s ================================================================================ ================================================================================ /home/rbon/Downloads/temp/php-5.6.30/ext/standard/tests/file/file_get_contents_error001.phpt ================================================================================ ** ERROR: process timed out ** ================================================================================ 001+ ** ERROR: process timed out ** 001- bool(false) ================================================================================ ================================================================================ /home/rbon/Downloads/temp/php-5.6.30/ext/standard/tests/file/lstat_stat_variation10.phpt ================================================================================ *** Testing stat() on directory after using is_dir() on it *** bool(true) bool(true) bool(true) Error: stat1 do not match with stat2 at key value: 8 Error: stat1 do not match with stat2 at key value: atime Dumping stat array 1... array(26) { [0]=> int(64771) [1]=> int(8264509) [2]=> int(16893) [3]=> int(2) [4]=> int(1000) [5]=> int(1000) [6]=> int(0) [7]=> int(4096) [8]=> int(1486161005) [9]=> int(1486161005) [10]=> int(1486161005) [11]=> int(4096) [12]=> int(8) ["dev"]=> int(64771) ["ino"]=> int(8264509) ["mode"]=> int(16893) ["nlink"]=> int(2) ["uid"]=> int(1000) ["gid"]=> int(1000) ["rdev"]=> int(0) ["size"]=> int(4096) ["atime"]=> int(1486161005) ["mtime"]=> int(1486161005) ["ctime"]=> int(1486161005) ["blksize"]=> int(4096) ["blocks"]=> int(8) } Dumping stat array 2... array(26) { [0]=> int(64771) [1]=> int(8264509) [2]=> int(16893) [3]=> int(2) [4]=> int(1000) [5]=> int(1000) [6]=> int(0) [7]=> int(4096) [8]=> int(1486161007) [9]=> int(1486161005) [10]=> int(1486161005) [11]=> int(4096) [12]=> int(8) ["dev"]=> int(64771) ["ino"]=> int(8264509) ["mode"]=> int(16893) ["nlink"]=> int(2) ["uid"]=> int(1000) ["gid"]=> int(1000) ["rdev"]=> int(0) ["size"]=> int(4096) ["atime"]=> int(1486161007) ["mtime"]=> int(1486161005) ["ctime"]=> int(1486161005) ["blksize"]=> int(4096) ["blocks"]=> int(8) } bool(false) --- Done --- ================================================================================ 005+ Error: stat1 do not match with stat2 at key value: 8 006+ Error: stat1 do not match with stat2 at key value: atime 005- bool(true) 007- --- Done --- 008+ Dumping stat array 1... 009+ array(26) { 010+ [0]=> 011+ int(64771) 012+ [1]=> 013+ int(8264509) 014+ [2]=> 015+ int(16893) 016+ [3]=> 017+ int(2) 018+ [4]=> 019+ int(1000) 020+ [5]=> 021+ int(1000) 022+ [6]=> 023+ int(0) 024+ [7]=> 025+ int(4096) 026+ [8]=> 027+ int(1486161005) 028+ [9]=> 029+ int(1486161005) 030+ [10]=> 031+ int(1486161005) 032+ [11]=> 033+ int(4096) 034+ [12]=> 035+ int(8) 036+ ["dev"]=> 037+ int(64771) 038+ ["ino"]=> 039+ int(8264509) 040+ ["mode"]=> 041+ int(16893) 042+ ["nlink"]=> 043+ int(2) 044+ ["uid"]=> 045+ int(1000) 046+ ["gid"]=> 047+ int(1000) 048+ ["rdev"]=> 049+ int(0) 050+ ["size"]=> 051+ int(4096) 052+ ["atime"]=> 053+ int(1486161005) 054+ ["mtime"]=> 055+ int(1486161005) 056+ ["ctime"]=> 057+ int(1486161005) 058+ ["blksize"]=> 059+ int(4096) 060+ ["blocks"]=> 061+ int(8) 062+ } 063+ 064+ Dumping stat array 2... 065+ array(26) { 066+ [0]=> 067+ int(64771) 068+ [1]=> 069+ int(8264509) 070+ [2]=> 071+ int(16893) 072+ [3]=> 073+ int(2) 074+ [4]=> 075+ int(1000) 076+ [5]=> 077+ int(1000) 078+ [6]=> 079+ int(0) 080+ [7]=> 081+ int(4096) 082+ [8]=> 083+ int(1486161007) 084+ [9]=> 085+ int(1486161005) 086+ [10]=> 087+ int(1486161005) 088+ [11]=> 089+ int(4096) 090+ [12]=> 091+ int(8) 092+ ["dev"]=> 093+ int(64771) 094+ ["ino"]=> 095+ int(8264509) 096+ ["mode"]=> 097+ int(16893) 098+ ["nlink"]=> 099+ int(2) 100+ ["uid"]=> 101+ int(1000) 102+ ["gid"]=> 103+ int(1000) 104+ ["rdev"]=> 105+ int(0) 106+ ["size"]=> 107+ int(4096) 108+ ["atime"]=> 109+ int(1486161007) 110+ ["mtime"]=> 111+ int(1486161005) 112+ ["ctime"]=> 113+ int(1486161005) 114+ ["blksize"]=> 115+ int(4096) 116+ ["blocks"]=> 117+ int(8) 118+ } 119+ bool(false) 120+ 121+ --- Done --- ================================================================================ ================================================================================ BUILD ENVIRONMENT ================================================================================ OS: Linux - Linux localhost.localdomainq 4.9.5-200.fc25.x86_64 #1 SMP Fri Jan 20 12:24:16 UTC 2017 x86_64 Autoconf: autoconf (GNU Autoconf) 2.69 Copyright (C) 2012 Free Software Foundation, Inc. License GPLv3+/Autoconf: GNU GPL version 3 or later <http://gnu.org/licenses/gpl.html>, <http://gnu.org/licenses/exceptions.html> This is free software: you are free to change and redistribute it. There is NO WARRANTY, to the extent permitted by law. Written by David J. MacKenzie and Akim Demaille. Bundled Libtool: ltmain.sh (GNU libtool) 1.5.26 (1.1220.2.492 2008/01/30 06:40:56) Copyright (C) 2008 Free Software Foundation, Inc. This is free software; see the source for copying conditions. There is NO warranty; not even for MERCHANTABILITY or FITNESS FOR A PARTICULAR PURPOSE. System Libtool: ltmain.sh (GNU libtool) 1.5.26 (1.1220.2.492 2008/01/30 06:40:56) Copyright (C) 2008 Free Software Foundation, Inc. This is free software; see the source for copying conditions. There is NO warranty; not even for MERCHANTABILITY or FITNESS FOR A PARTICULAR PURPOSE. Compiler: Using built-in specs. COLLECT_GCC=cc COLLECT_LTO_WRAPPER=/usr/libexec/gcc/x86_64-redhat-linux/6.3.1/lto-wrapper Target: x86_64-redhat-linux Configured with: ../configure --enable-bootstrap --enable-languages=c,c++,objc,obj-c++,fortran,ada,go,lto --prefix=/usr --mandir=/usr/share/man --infodir=/usr/share/info --with-bugurl=http://bugzilla.redhat.com/bugzilla --enable-shared --enable-threads=posix --enable-checking=release --enable-multilib --with-system-zlib --enable-__cxa_atexit --disable-libunwind-exceptions --enable-gnu-unique-object --enable-linker-build-id --with-linker-hash-style=gnu --enable-plugin --enable-initfini-array --disable-libgcj --with-isl --enable-libmpx --enable-gnu-indirect-function --with-tune=generic --with-arch_32=i686 --build=x86_64-redhat-linux Thread model: posix gcc version 6.3.1 20161221 (Red Hat 6.3.1-1) (GCC) Bison: Libraries: linux-vdso.so.1 (0x00007ffe14f2c000) libcrypt.so.1 => /lib64/libcrypt.so.1 (0x00007fda1ec5b000) libz.so.1 => /lib64/libz.so.1 (0x00007fda1ea45000) libexslt.so.0 => /lib64/libexslt.so.0 (0x00007fda1e82f000) libresolv.so.2 => /lib64/libresolv.so.2 (0x00007fda1e614000) libpq.so.5 => /lib64/libpq.so.5 (0x00007fda1e3e4000) librt.so.1 => /lib64/librt.so.1 (0x00007fda1e1da000) libldap-2.4.so.2 => /lib64/libldap-2.4.so.2 (0x00007fda1df89000) liblber-2.4.so.2 => /lib64/liblber-2.4.so.2 (0x00007fda1dd7a000) libstdc++.so.6 => /lib64/libstdc++.so.6 (0x00007fda1d9f2000) libpng16.so.16 => /lib64/libpng16.so.16 (0x00007fda1d7bf000) libjpeg.so.62 => /lib64/libjpeg.so.62 (0x00007fda1d555000) libcurl.so.4 => /lib64/libcurl.so.4 (0x00007fda1d2d5000) libm.so.6 => /lib64/libm.so.6 (0x00007fda1cfcc000) libdl.so.2 => /lib64/libdl.so.2 (0x00007fda1cdc8000) libnsl.so.1 => /lib64/libnsl.so.1 (0x00007fda1cbaf000) libxml2.so.2 => /lib64/libxml2.so.2 (0x00007fda1c848000) libgssapi_krb5.so.2 => /lib64/libgssapi_krb5.so.2 (0x00007fda1c5fb000) libkrb5.so.3 => /lib64/libkrb5.so.3 (0x00007fda1c313000) libk5crypto.so.3 => /lib64/libk5crypto.so.3 (0x00007fda1c0e2000) libcom_err.so.2 => /lib64/libcom_err.so.2 (0x00007fda1bede000) libssl.so.10 => /lib64/libssl.so.10 (0x00007fda1bc6c000) libcrypto.so.10 => /lib64/libcrypto.so.10 (0x00007fda1b80c000) libfreetype.so.6 => /lib64/libfreetype.so.6 (0x00007fda1b561000) libicui18n.so.57 => /lib64/libicui18n.so.57 (0x00007fda1b0e7000) libicuuc.so.57 => /lib64/libicuuc.so.57 (0x00007fda1ad3e000) libicudata.so.57 => /lib64/libicudata.so.57 (0x00007fda192c1000) libicuio.so.57 => /lib64/libicuio.so.57 (0x00007fda190b3000) libxslt.so.1 => /lib64/libxslt.so.1 (0x00007fda18e74000) libgcc_s.so.1 => /lib64/libgcc_s.so.1 (0x00007fda18c5d000) libc.so.6 => /lib64/libc.so.6 (0x00007fda18895000) libfreebl3.so => /lib64/libfreebl3.so (0x00007fda18692000) libgcrypt.so.20 => /lib64/libgcrypt.so.20 (0x00007fda183ac000) libgpg-error.so.0 => /lib64/libgpg-error.so.0 (0x00007fda18198000) libldap_r-2.4.so.2 => /lib64/libldap_r-2.4.so.2 (0x00007fda17f3e000) libpthread.so.0 => /lib64/libpthread.so.0 (0x00007fda17d20000) libsasl2.so.3 => /lib64/libsasl2.so.3 (0x00007fda17b01000) libssl3.so => /lib64/libssl3.so (0x00007fda178b5000) libsmime3.so => /lib64/libsmime3.so (0x00007fda1768e000) libnss3.so => /lib64/libnss3.so (0x00007fda17364000) libnssutil3.so => /lib64/libnssutil3.so (0x00007fda17136000) libplds4.so => /lib64/libplds4.so (0x00007fda16f32000) libplc4.so => /lib64/libplc4.so (0x00007fda16d2b000) libnspr4.so => /lib64/libnspr4.so (0x00007fda16aec000) /lib64/ld-linux-x86-64.so.2 (0x0000563b61eb3000) libnghttp2.so.14 => /lib64/libnghttp2.so.14 (0x00007fda168c7000) libidn2.so.0 => /lib64/libidn2.so.0 (0x00007fda16690000) libssh2.so.1 => /lib64/libssh2.so.1 (0x00007fda16463000) libpsl.so.5 => /lib64/libpsl.so.5 (0x00007fda16255000) liblzma.so.5 => /lib64/liblzma.so.5 (0x00007fda1602d000) libkrb5support.so.0 => /lib64/libkrb5support.so.0 (0x00007fda15e1e000) libkeyutils.so.1 => /lib64/libkeyutils.so.1 (0x00007fda15c1a000) libbz2.so.1 => /lib64/libbz2.so.1 (0x00007fda15a0a000) libunistring.so.2 => /lib64/libunistring.so.2 (0x00007fda156d8000) libselinux.so.1 => /lib64/libselinux.so.1 (0x00007fda154b1000) libpcre.so.1 => /lib64/libpcre.so.1 (0x00007fda1523e000) ================================================================================ PHPINFO ================================================================================ phpinfo() PHP Version => 5.6.30 System => Linux localhost.localdomainq 4.9.5-200.fc25.x86_64 #1 SMP Fri Jan 20 12:24:16 UTC 2017 x86_64 Build Date => Feb 3 2017 14:07:03 Configure Command => './configure' '--prefix=/opt/php/php-5.6.30' '--with-apxs2=/usr/local/apache2/bin/apxs' '--enable-mbstring' '--with-curl' '--with-openssl' '--with-xmlrpc' '--enable-soap' '--enable-zip' '--with-gd' '--with-jpeg-dir' '--with-png-dir' '--with-mysql' '--with-pgsql' '--enable-embedded-mysqli' '--with-freetype-dir' '--enable-intl' '--with-xsl' '--with-libdir=lib64' '--with-config-file-path=/opt/php/config/php-5.6.30' '--with-config-file-scan-dir=/opt/php/config/php-5.6.30/php.d' '--with-system-ciphers' '--with-zlib' '--with-kerberos' '--with-mhash' '--enable-dtrace' '--enable-phpdbg' '--with-ldap' Server API => Command Line Interface Virtual Directory Support => disabled Configuration File (php.ini) Path => /opt/php/config/php-5.6.30 Loaded Configuration File => (none) Scan this dir for additional .ini files => /opt/php/config/php-5.6.30/php.d Additional .ini files parsed => (none) PHP API => 20131106 PHP Extension => 20131226 Zend Extension => 220131226 Zend Extension Build => API220131226,NTS PHP Extension Build => API20131226,NTS Debug Build => no Thread Safety => disabled Zend Signal Handling => disabled Zend Memory Manager => enabled Zend Multibyte Support => provided by mbstring IPv6 Support => enabled DTrace Support => enabled Registered PHP Streams => https, ftps, compress.zlib, php, file, glob, data, http, ftp, phar, zip Registered Stream Socket Transports => tcp, udp, unix, udg, ssl, sslv3, tls, tlsv1.0, tlsv1.1, tlsv1.2 Registered Stream Filters => zlib.*, convert.iconv.*, string.rot13, string.toupper, string.tolower, string.strip_tags, convert.*, consumed, dechunk This program makes use of the Zend Scripting Language Engine: Zend Engine v2.6.0, Copyright (c) 1998-2016 Zend Technologies _______________________________________________________________________ Configuration Core PHP Version => 5.6.30 Directive => Local Value => Master Value allow_url_fopen => On => On allow_url_include => Off => Off always_populate_raw_post_data => 0 => 0 arg_separator.input => & => & arg_separator.output => & => & asp_tags => Off => Off auto_append_file => no value => no value auto_globals_jit => On => On auto_prepend_file => no value => no value browscap => no value => no value default_charset => UTF-8 => UTF-8 default_mimetype => text/html => text/html disable_classes => no value => no value disable_functions => no value => no value display_errors => STDERR => STDERR display_startup_errors => Off => Off doc_root => no value => no value docref_ext => no value => no value docref_root => no value => no value enable_dl => On => On enable_post_data_reading => On => On error_append_string => no value => no value error_log => no value => no value error_prepend_string => no value => no value error_reporting => no value => no value exit_on_timeout => Off => Off expose_php => On => On extension_dir => /opt/php/php-5.6.30/lib/php/extensions/no-debug-non-zts-20131226 => /opt/php/php-5.6.30/lib/php/extensions/no-debug-non-zts-20131226 file_uploads => On => On highlight.comment => <font style="color: #FF8000">#FF8000</font> => <font style="color: #FF8000">#FF8000</font> highlight.default => <font style="color: #0000BB">#0000BB</font> => <font style="color: #0000BB">#0000BB</font> highlight.html => <font style="color: #000000">#000000</font> => <font style="color: #000000">#000000</font> highlight.keyword => <font style="color: #007700">#007700</font> => <font style="color: #007700">#007700</font> highlight.string => <font style="color: #DD0000">#DD0000</font> => <font style="color: #DD0000">#DD0000</font> html_errors => Off => Off ignore_repeated_errors => Off => Off ignore_repeated_source => Off => Off ignore_user_abort => Off => Off implicit_flush => On => On include_path => .:/opt/php/php-5.6.30/lib/php => .:/opt/php/php-5.6.30/lib/php input_encoding => no value => no value internal_encoding => no value => no value log_errors => Off => Off log_errors_max_len => 1024 => 1024 mail.add_x_header => Off => Off mail.force_extra_parameters => no value => no value mail.log => no value => no value max_execution_time => 0 => 0 max_file_uploads => 20 => 20 max_input_nesting_level => 64 => 64 max_input_time => -1 => -1 max_input_vars => 1000 => 1000 memory_limit => 128M => 128M open_basedir => no value => no value output_buffering => 0 => 0 output_encoding => no value => no value output_handler => no value => no value post_max_size => 8M => 8M precision => 14 => 14 realpath_cache_size => 16K => 16K realpath_cache_ttl => 120 => 120 register_argc_argv => On => On report_memleaks => On => On report_zend_debug => Off => Off request_order => no value => no value sendmail_from => no value => no value sendmail_path => /usr/sbin/sendmail -t -i => /usr/sbin/sendmail -t -i serialize_precision => 17 => 17 short_open_tag => On => On SMTP => localhost => localhost smtp_port => 25 => 25 sql.safe_mode => Off => Off sys_temp_dir => no value => no value track_errors => Off => Off unserialize_callback_func => no value => no value upload_max_filesize => 2M => 2M upload_tmp_dir => no value => no value user_dir => no value => no value user_ini.cache_ttl => 300 => 300 user_ini.filename => .user.ini => .user.ini variables_order => EGPCS => EGPCS xmlrpc_error_number => 0 => 0 xmlrpc_errors => Off => Off zend.detect_unicode => On => On zend.enable_gc => On => On zend.multibyte => Off => Off zend.script_encoding => no value => no value ctype ctype functions => enabled curl cURL support => enabled cURL Information => 7.51.0 Age => 3 Features AsynchDNS => Yes CharConv => No Debug => No GSS-Negotiate => No IDN => Yes IPv6 => Yes krb4 => No Largefile => Yes libz => Yes NTLM => Yes NTLMWB => Yes SPNEGO => Yes SSL => Yes SSPI => No TLS-SRP => No Protocols => dict, file, ftp, ftps, gopher, http, https, imap, imaps, ldap, ldaps, pop3, pop3s, rtsp, scp, sftp, smb, smbs, smtp, smtps, telnet, tftp Host => x86_64-redhat-linux-gnu SSL Version => NSS/3.27 ZLib Version => 1.2.8 libSSH Version => libssh2/1.8.0 date date/time support => enabled "Olson" Timezone Database Version => 2016.10 Timezone Database => internal Default timezone => UTC Directive => Local Value => Master Value date.default_latitude => 31.7667 => 31.7667 date.default_longitude => 35.2333 => 35.2333 date.sunrise_zenith => 90.583333 => 90.583333 date.sunset_zenith => 90.583333 => 90.583333 date.timezone => no value => no value dom DOM/XML => enabled DOM/XML API Version => 20031129 libxml Version => 2.9.3 HTML Support => enabled XPath Support => enabled XPointer Support => enabled Schema Support => enabled RelaxNG Support => enabled ereg Regex Library => Bundled library enabled fileinfo fileinfo support => enabled version => 1.0.5 libmagic => 517 filter Input Validation and Filtering => enabled Revision => $Id: 5b79667bd9a68977a9b4f7505223a8e216e04908 $ Directive => Local Value => Master Value filter.default => unsafe_raw => unsafe_raw filter.default_flags => no value => no value gd GD Support => enabled GD Version => bundled (2.1.0 compatible) FreeType Support => enabled FreeType Linkage => with freetype FreeType Version => 2.6.5 GIF Read Support => enabled GIF Create Support => enabled JPEG Support => enabled libJPEG Version => 6b PNG Support => enabled libPNG Version => 1.6.27 WBMP Support => enabled XBM Support => enabled Directive => Local Value => Master Value gd.jpeg_ignore_warning => 0 => 0 hash hash support => enabled Hashing Engines => md2 md4 md5 sha1 sha224 sha256 sha384 sha512 ripemd128 ripemd160 ripemd256 ripemd320 whirlpool tiger128,3 tiger160,3 tiger192,3 tiger128,4 tiger160,4 tiger192,4 snefru snefru256 gost gost-crypto adler32 crc32 crc32b fnv132 fnv1a32 fnv164 fnv1a64 joaat haval128,3 haval160,3 haval192,3 haval224,3 haval256,3 haval128,4 haval160,4 haval192,4 haval224,4 haval256,4 haval128,5 haval160,5 haval192,5 haval224,5 haval256,5 iconv iconv support => enabled iconv implementation => glibc iconv library version => 2.24 Directive => Local Value => Master Value iconv.input_encoding => no value => no value iconv.internal_encoding => no value => no value iconv.output_encoding => no value => no value intl Internationalization support => enabled version => 1.1.0 ICU version => 57.1 ICU Data version => 57.1 Directive => Local Value => Master Value intl.default_locale => no value => no value intl.error_level => 0 => 0 intl.use_exceptions => 0 => 0 json json support => enabled json version => 1.2.1 ldap LDAP Support => enabled RCS Version => $Id: 8ab0fe072786e6f8d7dbd47b6a4897e81ce89ec3 $ Total Links => 0/unlimited API Version => 3001 Vendor Name => OpenLDAP Vendor Version => 20444 Directive => Local Value => Master Value ldap.max_links => Unlimited => Unlimited libxml libXML support => active libXML Compiled Version => 2.9.3 libXML Loaded Version => 20903 libXML streams => enabled mbstring Multibyte Support => enabled Multibyte string engine => libmbfl HTTP input encoding translation => disabled libmbfl version => 1.3.2 mbstring extension makes use of "streamable kanji code filter and converter", which is distributed under the GNU Lesser General Public License version 2.1. Multibyte (japanese) regex support => enabled Multibyte regex (oniguruma) backtrack check => On Multibyte regex (oniguruma) version => 5.9.5 Directive => Local Value => Master Value mbstring.detect_order => no value => no value mbstring.encoding_translation => Off => Off mbstring.func_overload => 0 => 0 mbstring.http_input => no value => no value mbstring.http_output => no value => no value mbstring.http_output_conv_mimetypes => ^(text/|application/xhtml\+xml) => ^(text/|application/xhtml\+xml) mbstring.internal_encoding => no value => no value mbstring.language => neutral => neutral mbstring.strict_detection => Off => Off mbstring.substitute_character => no value => no value mhash MHASH support => Enabled MHASH API Version => Emulated Support mysql MySQL Support => enabled Active Persistent Links => 0 Active Links => 0 Client API version => mysqlnd 5.0.11-dev - 20120503 - $Id: 76b08b24596e12d4553bd41fc93cccd5bac2fe7a $ Directive => Local Value => Master Value mysql.allow_local_infile => On => On mysql.allow_persistent => On => On mysql.connect_timeout => 60 => 60 mysql.default_host => no value => no value mysql.default_password => no value => no value mysql.default_port => no value => no value mysql.default_socket => /var/lib/mysql/mysql.sock => /var/lib/mysql/mysql.sock mysql.default_user => no value => no value mysql.max_links => Unlimited => Unlimited mysql.max_persistent => Unlimited => Unlimited mysql.trace_mode => Off => Off mysqlnd mysqlnd => enabled Version => mysqlnd 5.0.11-dev - 20120503 - $Id: 76b08b24596e12d4553bd41fc93cccd5bac2fe7a $ Compression => supported core SSL => supported extended SSL => supported Command buffer size => 4096 Read buffer size => 32768 Read timeout => 31536000 Collecting statistics => Yes Collecting memory statistics => No Tracing => n/a Loaded plugins => mysqlnd,debug_trace,auth_plugin_mysql_native_password,auth_plugin_mysql_clear_password,auth_plugin_sha256_password API Extensions => mysql mysqlnd statistics => bytes_sent => 0 bytes_received => 0 packets_sent => 0 packets_received => 0 protocol_overhead_in => 0 protocol_overhead_out => 0 bytes_received_ok_packet => 0 bytes_received_eof_packet => 0 bytes_received_rset_header_packet => 0 bytes_received_rset_field_meta_packet => 0 bytes_received_rset_row_packet => 0 bytes_received_prepare_response_packet => 0 bytes_received_change_user_packet => 0 packets_sent_command => 0 packets_received_ok => 0 packets_received_eof => 0 packets_received_rset_header => 0 packets_received_rset_field_meta => 0 packets_received_rset_row => 0 packets_received_prepare_response => 0 packets_received_change_user => 0 result_set_queries => 0 non_result_set_queries => 0 no_index_used => 0 bad_index_used => 0 slow_queries => 0 buffered_sets => 0 unbuffered_sets => 0 ps_buffered_sets => 0 ps_unbuffered_sets => 0 flushed_normal_sets => 0 flushed_ps_sets => 0 ps_prepared_never_executed => 0 ps_prepared_once_executed => 0 rows_fetched_from_server_normal => 0 rows_fetched_from_server_ps => 0 rows_buffered_from_client_normal => 0 rows_buffered_from_client_ps => 0 rows_fetched_from_client_normal_buffered => 0 rows_fetched_from_client_normal_unbuffered => 0 rows_fetched_from_client_ps_buffered => 0 rows_fetched_from_client_ps_unbuffered => 0 rows_fetched_from_client_ps_cursor => 0 rows_affected_normal => 0 rows_affected_ps => 0 rows_skipped_normal => 0 rows_skipped_ps => 0 copy_on_write_saved => 0 copy_on_write_performed => 0 command_buffer_too_small => 0 connect_success => 0 connect_failure => 0 connection_reused => 0 reconnect => 0 pconnect_success => 0 active_connections => 0 active_persistent_connections => 0 explicit_close => 0 implicit_close => 0 disconnect_close => 0 in_middle_of_command_close => 0 explicit_free_result => 0 implicit_free_result => 0 explicit_stmt_close => 0 implicit_stmt_close => 0 mem_emalloc_count => 0 mem_emalloc_amount => 0 mem_ecalloc_count => 0 mem_ecalloc_amount => 0 mem_erealloc_count => 0 mem_erealloc_amount => 0 mem_efree_count => 0 mem_efree_amount => 0 mem_malloc_count => 0 mem_malloc_amount => 0 mem_calloc_count => 0 mem_calloc_amount => 0 mem_realloc_count => 0 mem_realloc_amount => 0 mem_free_count => 0 mem_free_amount => 0 mem_estrndup_count => 0 mem_strndup_count => 0 mem_estndup_count => 0 mem_strdup_count => 0 proto_text_fetched_null => 0 proto_text_fetched_bit => 0 proto_text_fetched_tinyint => 0 proto_text_fetched_short => 0 proto_text_fetched_int24 => 0 proto_text_fetched_int => 0 proto_text_fetched_bigint => 0 proto_text_fetched_decimal => 0 proto_text_fetched_float => 0 proto_text_fetched_double => 0 proto_text_fetched_date => 0 proto_text_fetched_year => 0 proto_text_fetched_time => 0 proto_text_fetched_datetime => 0 proto_text_fetched_timestamp => 0 proto_text_fetched_string => 0 proto_text_fetched_blob => 0 proto_text_fetched_enum => 0 proto_text_fetched_set => 0 proto_text_fetched_geometry => 0 proto_text_fetched_other => 0 proto_binary_fetched_null => 0 proto_binary_fetched_bit => 0 proto_binary_fetched_tinyint => 0 proto_binary_fetched_short => 0 proto_binary_fetched_int24 => 0 proto_binary_fetched_int => 0 proto_binary_fetched_bigint => 0 proto_binary_fetched_decimal => 0 proto_binary_fetched_float => 0 proto_binary_fetched_double => 0 proto_binary_fetched_date => 0 proto_binary_fetched_year => 0 proto_binary_fetched_time => 0 proto_binary_fetched_datetime => 0 proto_binary_fetched_timestamp => 0 proto_binary_fetched_string => 0 proto_binary_fetched_json => 0 proto_binary_fetched_blob => 0 proto_binary_fetched_enum => 0 proto_binary_fetched_set => 0 proto_binary_fetched_geometry => 0 proto_binary_fetched_other => 0 init_command_executed_count => 0 init_command_failed_count => 0 com_quit => 0 com_init_db => 0 com_query => 0 com_field_list => 0 com_create_db => 0 com_drop_db => 0 com_refresh => 0 com_shutdown => 0 com_statistics => 0 com_process_info => 0 com_connect => 0 com_process_kill => 0 com_debug => 0 com_ping => 0 com_time => 0 com_delayed_insert => 0 com_change_user => 0 com_binlog_dump => 0 com_table_dump => 0 com_connect_out => 0 com_register_slave => 0 com_stmt_prepare => 0 com_stmt_execute => 0 com_stmt_send_long_data => 0 com_stmt_close => 0 com_stmt_reset => 0 com_stmt_set_option => 0 com_stmt_fetch => 0 com_deamon => 0 bytes_received_real_data_normal => 0 bytes_received_real_data_ps => 0 openssl OpenSSL support => enabled OpenSSL Library Version => OpenSSL 1.0.2j-fips 26 Sep 2016 OpenSSL Header Version => OpenSSL 1.0.2j-fips 26 Sep 2016 Openssl default config => /etc/pki/tls/openssl.cnf Directive => Local Value => Master Value openssl.cafile => no value => no value openssl.capath => no value => no value pcre PCRE (Perl Compatible Regular Expressions) Support => enabled PCRE Library Version => 8.38 2015-11-23 Directive => Local Value => Master Value pcre.backtrack_limit => 1000000 => 1000000 pcre.recursion_limit => 100000 => 100000 PDO PDO support => enabled PDO drivers => sqlite pdo_sqlite PDO Driver for SQLite 3.x => enabled SQLite Library => 3.8.10.2 pgsql PostgreSQL Support => enabled PostgreSQL(libpq) Version => 9.5.5 PostgreSQL(libpq) => PostgreSQL 9.5.5 on x86_64-redhat-linux-gnu, compiled by gcc (GCC) 6.2.1 20160916 (Red Hat 6.2.1-2), 64-bit Multibyte character support => enabled SSL support => enabled Active Persistent Links => 0 Active Links => 0 Directive => Local Value => Master Value pgsql.allow_persistent => On => On pgsql.auto_reset_persistent => Off => Off pgsql.ignore_notice => Off => Off pgsql.log_notice => Off => Off pgsql.max_links => Unlimited => Unlimited pgsql.max_persistent => Unlimited => Unlimited Phar Phar: PHP Archive support => enabled Phar EXT version => 2.0.2 Phar API version => 1.1.1 SVN revision => $Id: 780be432570e80dd34c1a9c217ef87ade22bf136 $ Phar-based phar archives => enabled Tar-based phar archives => enabled ZIP-based phar archives => enabled gzip compression => enabled bzip2 compression => disabled (install pecl/bz2) Native OpenSSL support => enabled Phar based on pear/PHP_Archive, original concept by Davey Shafik. Phar fully realized by Gregory Beaver and Marcus Boerger. Portions of tar implementation Copyright (c) 2003-2009 Tim Kientzle. Directive => Local Value => Master Value phar.cache_list => no value => no value phar.readonly => On => On phar.require_hash => On => On posix Revision => $Id: 5f4acc20904b1406142f2a0ede068db048c77e77 $ Reflection Reflection => enabled Version => $Id: 5f15287237d5f78d75b19c26915aa7bd83dee8b8 $ session Session Support => enabled Registered save handlers => files user Registered serializer handlers => php_serialize php php_binary Directive => Local Value => Master Value session.auto_start => Off => Off session.cache_expire => 180 => 180 session.cache_limiter => nocache => nocache session.cookie_domain => no value => no value session.cookie_httponly => Off => Off session.cookie_lifetime => 0 => 0 session.cookie_path => / => / session.cookie_secure => Off => Off session.entropy_file => /dev/urandom => /dev/urandom session.entropy_length => 32 => 32 session.gc_divisor => 100 => 100 session.gc_maxlifetime => 1440 => 1440 session.gc_probability => 1 => 1 session.hash_bits_per_character => 4 => 4 session.hash_function => 0 => 0 session.name => PHPSESSID => PHPSESSID session.referer_check => no value => no value session.save_handler => files => files session.save_path => no value => no value session.serialize_handler => php => php session.upload_progress.cleanup => On => On session.upload_progress.enabled => On => On session.upload_progress.freq => 1% => 1% session.upload_progress.min_freq => 1 => 1 session.upload_progress.name => PHP_SESSION_UPLOAD_PROGRESS => PHP_SESSION_UPLOAD_PROGRESS session.upload_progress.prefix => upload_progress_ => upload_progress_ session.use_cookies => On => On session.use_only_cookies => On => On session.use_strict_mode => Off => Off session.use_trans_sid => 0 => 0 SimpleXML Simplexml support => enabled Revision => $Id: d7077fc935154236afb4fe70814ba358efdbdca4 $ Schema support => enabled soap Soap Client => enabled Soap Server => enabled Directive => Local Value => Master Value soap.wsdl_cache => 1 => 1 soap.wsdl_cache_dir => /tmp => /tmp soap.wsdl_cache_enabled => 1 => 1 soap.wsdl_cache_limit => 5 => 5 soap.wsdl_cache_ttl => 86400 => 86400 SPL SPL support => enabled Interfaces => Countable, OuterIterator, RecursiveIterator, SeekableIterator, SplObserver, SplSubject Classes => AppendIterator, ArrayIterator, ArrayObject, BadFunctionCallException, BadMethodCallException, CachingIterator, CallbackFilterIterator, DirectoryIterator, DomainException, EmptyIterator, FilesystemIterator, FilterIterator, GlobIterator, InfiniteIterator, InvalidArgumentException, IteratorIterator, LengthException, LimitIterator, LogicException, MultipleIterator, NoRewindIterator, OutOfBoundsException, OutOfRangeException, OverflowException, ParentIterator, RangeException, RecursiveArrayIterator, RecursiveCachingIterator, RecursiveCallbackFilterIterator, RecursiveDirectoryIterator, RecursiveFilterIterator, RecursiveIteratorIterator, RecursiveRegexIterator, RecursiveTreeIterator, RegexIterator, RuntimeException, SplDoublyLinkedList, SplFileInfo, SplFileObject, SplFixedArray, SplHeap, SplMinHeap, SplMaxHeap, SplObjectStorage, SplPriorityQueue, SplQueue, SplStack, SplTempFileObject, UnderflowException, UnexpectedValueException sqlite3 SQLite3 support => enabled SQLite3 module version => 0.7-dev SQLite Library => 3.8.10.2 Directive => Local Value => Master Value sqlite3.extension_dir => no value => no value standard Dynamic Library Support => enabled Path to sendmail => /usr/sbin/sendmail -t -i Directive => Local Value => Master Value assert.active => 1 => 1 assert.bail => 0 => 0 assert.callback => no value => no value assert.quiet_eval => 0 => 0 assert.warning => 1 => 1 auto_detect_line_endings => 0 => 0 default_socket_timeout => 60 => 60 from => no value => no value url_rewriter.tags => a=href,area=href,frame=src,form=,fieldset= => a=href,area=href,frame=src,form=,fieldset= user_agent => no value => no value tokenizer Tokenizer Support => enabled xml XML Support => active XML Namespace Support => active libxml2 Version => 2.9.3 xmlreader XMLReader => enabled xmlrpc core library version => xmlrpc-epi v. 0.51 php extension version => 0.51 author => Dan Libby homepage => http://xmlrpc-epi.sourceforge.net open sourced by => Epinions.com xmlwriter XMLWriter => enabled xsl XSL => enabled libxslt Version => 1.1.28 libxslt compiled against libxml Version => 2.9.3 EXSLT => enabled libexslt Version => 1.1.28 zip Zip => enabled Zip version => 1.12.5 Libzip version => 0.11.2 zlib ZLib Support => enabled Stream Wrapper => compress.zlib:// Stream Filter => zlib.inflate, zlib.deflate Compiled Version => 1.2.8 Linked Version => 1.2.8 Directive => Local Value => Master Value zlib.output_compression => Off => Off zlib.output_compression_level => -1 => -1 zlib.output_handler => no value => no value Additional Modules Module Name Environment Variable => Value XDG_VTNR => 2 GRAILS_HOME => /home/rbon/Applications/grails LC_PAPER => en_CA.utf8 XDG_SESSION_ID => 3 TOMCAT_HOME => /home/rbon/Applications/tomcat HOSTNAME => localhost.localdomainq LC_MONETARY => en_CA.utf8 TEST_PHP_SRCDIR => /home/rbon/Downloads/temp/php-5.6.30 GIO_LAUNCHED_DESKTOP_FILE_PID => 3291 WAYLAND_DISPLAY => wayland-0 SHELL => /bin/bash XDG_MENU_PREFIX => gnome- TERM => xterm MAKEFLAGS => HISTSIZE => 1000 SSH_CLIENT => deleted GRADLE_HOME => /home/rbon/Applications/gradle LC_NUMERIC => en_CA.utf8 QTDIR => /usr/lib64/qt-3.3 QTINC => /usr/lib64/qt-3.3/include SSH_TTY => deleted USER => rbon LS_COLORS => rs=0:di=01;34:ln=01;36:mh=00:pi=40;33:so=01;35:do=01;35:bd=40;33;01:cd=40;33;01:or=40;31;01:mi=01;05;37;41:su=37;41:sg=30;43:ca=30;41:tw=30;42:ow=34;42:st=37;44:ex=01;32:*.tar=01;31:*.tgz=01;31:*.arc=01;31:*.arj=01;31:*.taz=01;31:*.lha=01;31:*.lz4=01;31:*.lzh=01;31:*.lzma=01;31:*.tlz=01;31:*.txz=01;31:*.tzo=01;31:*.t7z=01;31:*.zip=01;31:*.z=01;31:*.Z=01;31:*.dz=01;31:*.gz=01;31:*.lrz=01;31:*.lz=01;31:*.lzo=01;31:*.xz=01;31:*.bz2=01;31:*.bz=01;31:*.tbz=01;31:*.tbz2=01;31:*.tz=01;31:*.deb=01;31:*.rpm=01;31:*.jar=01;31:*.war=01;31:*.ear=01;31:*.sar=01;31:*.rar=01;31:*.alz=01;31:*.ace=01;31:*.zoo=01;31:*.cpio=01;31:*.7z=01;31:*.rz=01;31:*.cab=01;31:*.jpg=01;35:*.jpeg=01;35:*.gif=01;35:*.bmp=01;35:*.pbm=01;35:*.pgm=01;35:*.ppm=01;35:*.tga=01;35:*.xbm=01;35:*.xpm=01;35:*.tif=01;35:*.tiff=01;35:*.png=01;35:*.svg=01;35:*.svgz=01;35:*.mng=01;35:*.pcx=01;35:*.mov=01;35:*.mpg=01;35:*.mpeg=01;35:*.m2v=01;35:*.mkv=01;35:*.webm=01;35:*.ogm=01;35:*.mp4=01;35:*.m4v=01;35:*.mp4v=01;35:*.vob=01;35:*.qt=01;35:*.nuv=01;35:*.wmv=01;35:*.asf=01;35:*.rm=01;35:*.rmvb=01;35:*.flc=01;35:*.avi=01;35:*.fli=01;35:*.flv=01;35:*.gl=01;35:*.dl=01;35:*.xcf=01;35:*.xwd=01;35:*.yuv=01;35:*.cgm=01;35:*.emf=01;35:*.ogv=01;35:*.ogx=01;35:*.aac=01;36:*.au=01;36:*.flac=01;36:*.m4a=01;36:*.mid=01;36:*.midi=01;36:*.mka=01;36:*.mp3=01;36:*.mpc=01;36:*.ogg=01;36:*.ra=01;36:*.wav=01;36:*.oga=01;36:*.opus=01;36:*.spx=01;36:*.xspf=01;36: LD_LIBRARY_PATH => /home/rbon/.local/lib:/home/rbon/.local/lib:/usr/lib/oracle/11.2/client64/lib::/usr/lib/oracle/11.2/client64/lib:/usr/lib/oracle/11.2/client64/lib DESKTOP_AUTOSTART_ID => 1073dfdbb2e64212cb148579720034654600000029020002 MAKE_TERMOUT => /dev/pts/8 SSH_AUTH_SOCK => deleted USERNAME => rbon SESSION_MANAGER => local/unix:@/tmp/.ICE-unix/2902,unix/unix:/tmp/.ICE-unix/2902 MAKELEVEL => 1 GIO_LAUNCHED_DESKTOP_FILE => /home/rbon/.config/autostart/guake.desktop MFLAGS => DESKTOP_SESSION => gnome PATH => .:/home/rbon/bin:/usr/lib64/qt-3.3/bin:/usr/local/bin:/usr/local/sbin:/usr/bin:/usr/sbin:/usr/lib/oracle/12.1/client64/bin:/home/rbon/Applications/grails/bin:/home/rbon/Applications/gradle/bin TNS_ADMIN => /home/rbon/.oracle MAIL => /var/spool/mail/rbon _ => /home/rbon/Downloads/temp/php-5.6.30/sapi/cli/php QT_QPA_PLATFORMTHEME => qgnomeplatform QT_IM_MODULE => ibus XDG_SESSION_TYPE => wayland PWD => /home/rbon/Downloads/temp/php-5.6.30 XMODIFIERS => @im=ibus JAVA_HOME => /usr/java/default EDITOR => vi LANG => en_CA.UTF-8 TEST_PHP_EXECUTABLE => /home/rbon/Downloads/temp/php-5.6.30/sapi/cli/php MODULEPATH => /etc/scl/modulefiles:/etc/scl/modulefiles:/usr/share/Modules/modulefiles:/etc/modulefiles:/usr/share/modulefiles GDM_LANG => en_CA.UTF-8 LOADEDMODULES => LC_MEASUREMENT => en_CA.utf8 SQLPATH => /home/rbon/.oracle GDMSESSION => gnome HISTIGNORE => pwd:ls:la:ll: HISTCONTROL => erasedups:ignoreboth SSH_ASKPASS => /usr/libexec/openssh/gnome-ssh-askpass HOME => /home/rbon XDG_SEAT => seat0 SHLVL => 4 GNOME_DESKTOP_SESSION_ID => this-is-deprecated XDG_SESSION_DESKTOP => gnome LOGNAME => rbon QTLIB => /usr/lib64/qt-3.3/lib CVS_RSH => ssh MAKE_TERMERR => /dev/pts/8 SSH_CONNECTION => deleted XDG_DATA_DIRS => /home/rbon/.local/share/flatpak/exports/share/:/var/lib/flatpak/exports/share/:/usr/local/share/:/usr/share/ DBUS_SESSION_BUS_ADDRESS => unix:path=/run/user/1000/bus MODULESHOME => /usr/share/Modules LESSOPEN => ||/usr/bin/lesspipe.sh %s JOURNAL_STREAM => 8:25497 SCALA_HOME => /home/rbon/Applications/scala GUAKE_TAB_UUID => a2df0b85-b75d-4038-a417-2126ad9233fb XDG_RUNTIME_DIR => /run/user/1000 DISPLAY => :0 CC => cc ORACLE_HOME => /usr/lib/oracle/11.2/client64 XDG_CURRENT_DESKTOP => GNOME LC_TIME => en_CA.utf8 BASH_FUNC_module() => () { eval `/usr/bin/modulecmd bash $*` } BASH_FUNC_scl() => () { local CMD=$1; if [ "$CMD" = "load" -o "$CMD" = "unload" ]; then eval "module $@"; else /usr/bin/scl "$@"; fi } PHP Variables Variable => Value _SERVER["XDG_VTNR"] => 2 _SERVER["GRAILS_HOME"] => /home/rbon/Applications/grails _SERVER["LC_PAPER"] => en_CA.utf8 _SERVER["XDG_SESSION_ID"] => 3 _SERVER["TOMCAT_HOME"] => /home/rbon/Applications/tomcat _SERVER["HOSTNAME"] => localhost.localdomainq _SERVER["LC_MONETARY"] => en_CA.utf8 _SERVER["TEST_PHP_SRCDIR"] => /home/rbon/Downloads/temp/php-5.6.30 _SERVER["GIO_LAUNCHED_DESKTOP_FILE_PID"] => 3291 _SERVER["WAYLAND_DISPLAY"] => wayland-0 _SERVER["SHELL"] => /bin/bash _SERVER["XDG_MENU_PREFIX"] => gnome- _SERVER["TERM"] => xterm _SERVER["MAKEFLAGS"] => _SERVER["HISTSIZE"] => 1000 _SERVER["SSH_CLIENT"] => deleted _SERVER["GRADLE_HOME"] => /home/rbon/Applications/gradle _SERVER["LC_NUMERIC"] => en_CA.utf8 _SERVER["QTDIR"] => /usr/lib64/qt-3.3 _SERVER["QTINC"] => /usr/lib64/qt-3.3/include _SERVER["SSH_TTY"] => deleted _SERVER["USER"] => rbon _SERVER["LS_COLORS"] => rs=0:di=01;34:ln=01;36:mh=00:pi=40;33:so=01;35:do=01;35:bd=40;33;01:cd=40;33;01:or=40;31;01:mi=01;05;37;41:su=37;41:sg=30;43:ca=30;41:tw=30;42:ow=34;42:st=37;44:ex=01;32:*.tar=01;31:*.tgz=01;31:*.arc=01;31:*.arj=01;31:*.taz=01;31:*.lha=01;31:*.lz4=01;31:*.lzh=01;31:*.lzma=01;31:*.tlz=01;31:*.txz=01;31:*.tzo=01;31:*.t7z=01;31:*.zip=01;31:*.z=01;31:*.Z=01;31:*.dz=01;31:*.gz=01;31:*.lrz=01;31:*.lz=01;31:*.lzo=01;31:*.xz=01;31:*.bz2=01;31:*.bz=01;31:*.tbz=01;31:*.tbz2=01;31:*.tz=01;31:*.deb=01;31:*.rpm=01;31:*.jar=01;31:*.war=01;31:*.ear=01;31:*.sar=01;31:*.rar=01;31:*.alz=01;31:*.ace=01;31:*.zoo=01;31:*.cpio=01;31:*.7z=01;31:*.rz=01;31:*.cab=01;31:*.jpg=01;35:*.jpeg=01;35:*.gif=01;35:*.bmp=01;35:*.pbm=01;35:*.pgm=01;35:*.ppm=01;35:*.tga=01;35:*.xbm=01;35:*.xpm=01;35:*.tif=01;35:*.tiff=01;35:*.png=01;35:*.svg=01;35:*.svgz=01;35:*.mng=01;35:*.pcx=01;35:*.mov=01;35:*.mpg=01;35:*.mpeg=01;35:*.m2v=01;35:*.mkv=01;35:*.webm=01;35:*.ogm=01;35:*.mp4=01;35:*.m4v=01;35:*.mp4v=01;35:*.vob=01;35:*.qt=01;35:*.nuv=01;35:*.wmv=01;35:*.asf=01;35:*.rm=01;35:*.rmvb=01;35:*.flc=01;35:*.avi=01;35:*.fli=01;35:*.flv=01;35:*.gl=01;35:*.dl=01;35:*.xcf=01;35:*.xwd=01;35:*.yuv=01;35:*.cgm=01;35:*.emf=01;35:*.ogv=01;35:*.ogx=01;35:*.aac=01;36:*.au=01;36:*.flac=01;36:*.m4a=01;36:*.mid=01;36:*.midi=01;36:*.mka=01;36:*.mp3=01;36:*.mpc=01;36:*.ogg=01;36:*.ra=01;36:*.wav=01;36:*.oga=01;36:*.opus=01;36:*.spx=01;36:*.xspf=01;36: _SERVER["LD_LIBRARY_PATH"] => /home/rbon/.local/lib:/home/rbon/.local/lib:/usr/lib/oracle/11.2/client64/lib::/usr/lib/oracle/11.2/client64/lib:/usr/lib/oracle/11.2/client64/lib _SERVER["DESKTOP_AUTOSTART_ID"] => 1073dfdbb2e64212cb148579720034654600000029020002 _SERVER["MAKE_TERMOUT"] => /dev/pts/8 _SERVER["SSH_AUTH_SOCK"] => deleted _SERVER["USERNAME"] => rbon _SERVER["SESSION_MANAGER"] => local/unix:@/tmp/.ICE-unix/2902,unix/unix:/tmp/.ICE-unix/2902 _SERVER["MAKELEVEL"] => 1 _SERVER["GIO_LAUNCHED_DESKTOP_FILE"] => /home/rbon/.config/autostart/guake.desktop _SERVER["MFLAGS"] => _SERVER["DESKTOP_SESSION"] => gnome _SERVER["PATH"] => .:/home/rbon/bin:/usr/lib64/qt-3.3/bin:/usr/local/bin:/usr/local/sbin:/usr/bin:/usr/sbin:/usr/lib/oracle/12.1/client64/bin:/home/rbon/Applications/grails/bin:/home/rbon/Applications/gradle/bin _SERVER["TNS_ADMIN"] => /home/rbon/.oracle _SERVER["MAIL"] => /var/spool/mail/rbon _SERVER["_"] => /home/rbon/Downloads/temp/php-5.6.30/sapi/cli/php _SERVER["QT_QPA_PLATFORMTHEME"] => qgnomeplatform _SERVER["QT_IM_MODULE"] => ibus _SERVER["XDG_SESSION_TYPE"] => wayland _SERVER["PWD"] => /home/rbon/Downloads/temp/php-5.6.30 _SERVER["XMODIFIERS"] => @im=ibus _SERVER["JAVA_HOME"] => /usr/java/default _SERVER["EDITOR"] => vi _SERVER["LANG"] => en_CA.UTF-8 _SERVER["TEST_PHP_EXECUTABLE"] => /home/rbon/Downloads/temp/php-5.6.30/sapi/cli/php _SERVER["MODULEPATH"] => /etc/scl/modulefiles:/etc/scl/modulefiles:/usr/share/Modules/modulefiles:/etc/modulefiles:/usr/share/modulefiles _SERVER["GDM_LANG"] => en_CA.UTF-8 _SERVER["LOADEDMODULES"] => _SERVER["LC_MEASUREMENT"] => en_CA.utf8 _SERVER["SQLPATH"] => /home/rbon/.oracle _SERVER["GDMSESSION"] => gnome _SERVER["HISTIGNORE"] => pwd:ls:la:ll: _SERVER["HISTCONTROL"] => erasedups:ignoreboth _SERVER["SSH_ASKPASS"] => /usr/libexec/openssh/gnome-ssh-askpass _SERVER["HOME"] => /home/rbon _SERVER["XDG_SEAT"] => seat0 _SERVER["SHLVL"] => 4 _SERVER["GNOME_DESKTOP_SESSION_ID"] => this-is-deprecated _SERVER["XDG_SESSION_DESKTOP"] => gnome _SERVER["LOGNAME"] => rbon _SERVER["QTLIB"] => /usr/lib64/qt-3.3/lib _SERVER["CVS_RSH"] => ssh _SERVER["MAKE_TERMERR"] => /dev/pts/8 _SERVER["SSH_CONNECTION"] => deleted _SERVER["XDG_DATA_DIRS"] => /home/rbon/.local/share/flatpak/exports/share/:/var/lib/flatpak/exports/share/:/usr/local/share/:/usr/share/ _SERVER["DBUS_SESSION_BUS_ADDRESS"] => unix:path=/run/user/1000/bus _SERVER["MODULESHOME"] => /usr/share/Modules _SERVER["LESSOPEN"] => ||/usr/bin/lesspipe.sh %s _SERVER["JOURNAL_STREAM"] => 8:25497 _SERVER["SCALA_HOME"] => /home/rbon/Applications/scala _SERVER["GUAKE_TAB_UUID"] => a2df0b85-b75d-4038-a417-2126ad9233fb _SERVER["XDG_RUNTIME_DIR"] => /run/user/1000 _SERVER["DISPLAY"] => :0 _SERVER["CC"] => cc _SERVER["ORACLE_HOME"] => /usr/lib/oracle/11.2/client64 _SERVER["XDG_CURRENT_DESKTOP"] => GNOME _SERVER["LC_TIME"] => en_CA.utf8 _SERVER["BASH_FUNC_module()"] => () { eval `/usr/bin/modulecmd bash $*` } _SERVER["BASH_FUNC_scl()"] => () { local CMD=$1; if [ "$CMD" = "load" -o "$CMD" = "unload" ]; then eval "module $@"; else /usr/bin/scl "$@"; fi } _SERVER["PHP_SELF"] => _SERVER["SCRIPT_NAME"] => _SERVER["SCRIPT_FILENAME"] => _SERVER["PATH_TRANSLATED"] => _SERVER["DOCUMENT_ROOT"] => _SERVER["REQUEST_TIME_FLOAT"] => 1486161212.3457 _SERVER["REQUEST_TIME"] => 1486161212 _SERVER["argv"] => Array ( ) _SERVER["argc"] => 0 _ENV["XDG_VTNR"] => 2 _ENV["GRAILS_HOME"] => /home/rbon/Applications/grails _ENV["LC_PAPER"] => en_CA.utf8 _ENV["XDG_SESSION_ID"] => 3 _ENV["TOMCAT_HOME"] => /home/rbon/Applications/tomcat _ENV["HOSTNAME"] => localhost.localdomainq _ENV["LC_MONETARY"] => en_CA.utf8 _ENV["TEST_PHP_SRCDIR"] => /home/rbon/Downloads/temp/php-5.6.30 _ENV["GIO_LAUNCHED_DESKTOP_FILE_PID"] => 3291 _ENV["WAYLAND_DISPLAY"] => wayland-0 _ENV["SHELL"] => /bin/bash _ENV["XDG_MENU_PREFIX"] => gnome- _ENV["TERM"] => xterm _ENV["MAKEFLAGS"] => _ENV["HISTSIZE"] => 1000 _ENV["SSH_CLIENT"] => deleted _ENV["GRADLE_HOME"] => /home/rbon/Applications/gradle _ENV["LC_NUMERIC"] => en_CA.utf8 _ENV["QTDIR"] => /usr/lib64/qt-3.3 _ENV["QTINC"] => /usr/lib64/qt-3.3/include _ENV["SSH_TTY"] => deleted _ENV["USER"] => rbon _ENV["LS_COLORS"] => rs=0:di=01;34:ln=01;36:mh=00:pi=40;33:so=01;35:do=01;35:bd=40;33;01:cd=40;33;01:or=40;31;01:mi=01;05;37;41:su=37;41:sg=30;43:ca=30;41:tw=30;42:ow=34;42:st=37;44:ex=01;32:*.tar=01;31:*.tgz=01;31:*.arc=01;31:*.arj=01;31:*.taz=01;31:*.lha=01;31:*.lz4=01;31:*.lzh=01;31:*.lzma=01;31:*.tlz=01;31:*.txz=01;31:*.tzo=01;31:*.t7z=01;31:*.zip=01;31:*.z=01;31:*.Z=01;31:*.dz=01;31:*.gz=01;31:*.lrz=01;31:*.lz=01;31:*.lzo=01;31:*.xz=01;31:*.bz2=01;31:*.bz=01;31:*.tbz=01;31:*.tbz2=01;31:*.tz=01;31:*.deb=01;31:*.rpm=01;31:*.jar=01;31:*.war=01;31:*.ear=01;31:*.sar=01;31:*.rar=01;31:*.alz=01;31:*.ace=01;31:*.zoo=01;31:*.cpio=01;31:*.7z=01;31:*.rz=01;31:*.cab=01;31:*.jpg=01;35:*.jpeg=01;35:*.gif=01;35:*.bmp=01;35:*.pbm=01;35:*.pgm=01;35:*.ppm=01;35:*.tga=01;35:*.xbm=01;35:*.xpm=01;35:*.tif=01;35:*.tiff=01;35:*.png=01;35:*.svg=01;35:*.svgz=01;35:*.mng=01;35:*.pcx=01;35:*.mov=01;35:*.mpg=01;35:*.mpeg=01;35:*.m2v=01;35:*.mkv=01;35:*.webm=01;35:*.ogm=01;35:*.mp4=01;35:*.m4v=01;35:*.mp4v=01;35:*.vob=01;35:*.qt=01;35:*.nuv=01;35:*.wmv=01;35:*.asf=01;35:*.rm=01;35:*.rmvb=01;35:*.flc=01;35:*.avi=01;35:*.fli=01;35:*.flv=01;35:*.gl=01;35:*.dl=01;35:*.xcf=01;35:*.xwd=01;35:*.yuv=01;35:*.cgm=01;35:*.emf=01;35:*.ogv=01;35:*.ogx=01;35:*.aac=01;36:*.au=01;36:*.flac=01;36:*.m4a=01;36:*.mid=01;36:*.midi=01;36:*.mka=01;36:*.mp3=01;36:*.mpc=01;36:*.ogg=01;36:*.ra=01;36:*.wav=01;36:*.oga=01;36:*.opus=01;36:*.spx=01;36:*.xspf=01;36: _ENV["LD_LIBRARY_PATH"] => /home/rbon/.local/lib:/home/rbon/.local/lib:/usr/lib/oracle/11.2/client64/lib::/usr/lib/oracle/11.2/client64/lib:/usr/lib/oracle/11.2/client64/lib _ENV["DESKTOP_AUTOSTART_ID"] => 1073dfdbb2e64212cb148579720034654600000029020002 _ENV["MAKE_TERMOUT"] => /dev/pts/8 _ENV["SSH_AUTH_SOCK"] => deleted _ENV["USERNAME"] => rbon _ENV["SESSION_MANAGER"] => local/unix:@/tmp/.ICE-unix/2902,unix/unix:/tmp/.ICE-unix/2902 _ENV["MAKELEVEL"] => 1 _ENV["GIO_LAUNCHED_DESKTOP_FILE"] => /home/rbon/.config/autostart/guake.desktop _ENV["MFLAGS"] => _ENV["DESKTOP_SESSION"] => gnome _ENV["PATH"] => .:/home/rbon/bin:/usr/lib64/qt-3.3/bin:/usr/local/bin:/usr/local/sbin:/usr/bin:/usr/sbin:/usr/lib/oracle/12.1/client64/bin:/home/rbon/Applications/grails/bin:/home/rbon/Applications/gradle/bin _ENV["TNS_ADMIN"] => /home/rbon/.oracle _ENV["MAIL"] => /var/spool/mail/rbon _ENV["_"] => /home/rbon/Downloads/temp/php-5.6.30/sapi/cli/php _ENV["QT_QPA_PLATFORMTHEME"] => qgnomeplatform _ENV["QT_IM_MODULE"] => ibus _ENV["XDG_SESSION_TYPE"] => wayland _ENV["PWD"] => /home/rbon/Downloads/temp/php-5.6.30 _ENV["XMODIFIERS"] => @im=ibus _ENV["JAVA_HOME"] => /usr/java/default _ENV["EDITOR"] => vi _ENV["LANG"] => en_CA.UTF-8 _ENV["TEST_PHP_EXECUTABLE"] => /home/rbon/Downloads/temp/php-5.6.30/sapi/cli/php _ENV["MODULEPATH"] => /etc/scl/modulefiles:/etc/scl/modulefiles:/usr/share/Modules/modulefiles:/etc/modulefiles:/usr/share/modulefiles _ENV["GDM_LANG"] => en_CA.UTF-8 _ENV["LOADEDMODULES"] => _ENV["LC_MEASUREMENT"] => en_CA.utf8 _ENV["SQLPATH"] => /home/rbon/.oracle _ENV["GDMSESSION"] => gnome _ENV["HISTIGNORE"] => pwd:ls:la:ll: _ENV["HISTCONTROL"] => erasedups:ignoreboth _ENV["SSH_ASKPASS"] => /usr/libexec/openssh/gnome-ssh-askpass _ENV["HOME"] => /home/rbon _ENV["XDG_SEAT"] => seat0 _ENV["SHLVL"] => 4 _ENV["GNOME_DESKTOP_SESSION_ID"] => this-is-deprecated _ENV["XDG_SESSION_DESKTOP"] => gnome _ENV["LOGNAME"] => rbon _ENV["QTLIB"] => /usr/lib64/qt-3.3/lib _ENV["CVS_RSH"] => ssh _ENV["MAKE_TERMERR"] => /dev/pts/8 _ENV["SSH_CONNECTION"] => deleted _ENV["XDG_DATA_DIRS"] => /home/rbon/.local/share/flatpak/exports/share/:/var/lib/flatpak/exports/share/:/usr/local/share/:/usr/share/ _ENV["DBUS_SESSION_BUS_ADDRESS"] => unix:path=/run/user/1000/bus _ENV["MODULESHOME"] => /usr/share/Modules _ENV["LESSOPEN"] => ||/usr/bin/lesspipe.sh %s _ENV["JOURNAL_STREAM"] => 8:25497 _ENV["SCALA_HOME"] => /home/rbon/Applications/scala _ENV["GUAKE_TAB_UUID"] => a2df0b85-b75d-4038-a417-2126ad9233fb _ENV["XDG_RUNTIME_DIR"] => /run/user/1000 _ENV["DISPLAY"] => :0 _ENV["CC"] => cc _ENV["ORACLE_HOME"] => /usr/lib/oracle/11.2/client64 _ENV["XDG_CURRENT_DESKTOP"] => GNOME _ENV["LC_TIME"] => en_CA.utf8 _ENV["BASH_FUNC_module()"] => () { eval `/usr/bin/modulecmd bash $*` } _ENV["BASH_FUNC_scl()"] => () { local CMD=$1; if [ "$CMD" = "load" -o "$CMD" = "unload" ]; then eval "module $@"; else /usr/bin/scl "$@"; fi } PHP License This program is free software; you can redistribute it and/or modify it under the terms of the PHP License as published by the PHP Group and included in the distribution in the file: LICENSE This program is distributed in the hope that it will be useful, but WITHOUT ANY WARRANTY; without even the implied warranty of MERCHANTABILITY or FITNESS FOR A PARTICULAR PURPOSE. If you did not receive a copy of the PHP license, or have any questions about PHP licensing, please contact license@php.net.